{"text_format":"3","workbook":"xlsx","n_sheets":3,"sheets":["Entrada datos","Informe de ventas","Previsión de ventas"],"not_rendered":{"charts":5,"defined_names":7,"pivot_tables":1},"read":"whole","date_system":"1900"}

{"sheet":"Entrada datos","index":0,"n_rows":24,"n_cols":17,"rows_kept":24}
[{"$nulls":9},{"$f":"365*2","v":730}]
[null,"MENSUAL ENTRADA DATOS"]
[{"$nulls":11},"TOTALES",null,null,"PREVISIÓN"]
[]
[null,"FECHA","COMPAÑÍA","CANTIDAD","PLANEADA","COSTE","INGRESOS","MES","TRIMESTRE","AÑO","Nº MES (OCULTAR)","MES ","TRIMESTRE ","ANUAL ","MES  ","TRIMESTRE  ","AÑO  "]
[null,{"$f":"40657+(365*2)","v":"2013-04-23"},"A. Datum Corporation",{"v":6400,"d":"6,400.00 €"},{"v":6200,"d":"6,200.00 €"},{"v":4450,"d":"4,450.00 €"},{"$f":"tblData[[#This Row],[CANTIDAD]]-tblData[[#This Row],[COSTE]]","v":{"v":1950,"d":"1,950.00 €"}},{"$f":"DATE(YEAR('Entrada datos'!$B6),MONTH('Entrada datos'!$B6),1)","v":"2013-04-01"},{"$f":"LOOKUP(MONTH('Entrada datos'!$H6),{1,1;2,1;3,1;4,2;5,2;6,2;7,3;8,3;9,3;10,4;11,4;12,4})","v":{"v":2,"d":"Trimestre 2"}},{"$f":"YEAR('Entrada datos'!$B6)","v":2013},{"$f":"MONTH(tblData[[#This Row],[FECHA]])","v":4},{"$f":"SUMIFS(tblData[CANTIDAD],tblData[FECHA],\">=\"&EOMONTH(tblData[[#This Row],[FECHA]],-1)+1,tblData[FECHA],\"<=\"&EOMONTH(tblData[[#This Row],[FECHA]],0))","v":{"v":14600,"d":"14,600.00 €"}},{"$f":"SUMIFS(tblData[CANTIDAD],tblData[FECHA],\">=\"&DATE(YEAR(tblData[[#This Row],[FECHA]]),1,1),tblData[FECHA],\"<=\"&DATE(YEAR(tblData[[#This Row],[FECHA]]),12,31),tblData[TRIMESTRE],tblData[[#This Row],[TRIMESTRE]])","v":{"v":50800,"d":"50,800.00 €"}},{"$f":"SUMIFS(tblData[CANTIDAD],tblData[FECHA],\">=\"&DATE(YEAR(tblData[[#This Row],[FECHA]]),1,1),tblData[FECHA],\"<=\"&DATE(YEAR(tblData[[#This Row],[FECHA]]),12,31))","v":{"v":143800,"d":"143,800.00 €"}},{"$f":"IFERROR(TREND($L$6:INDEX($L:$L,ROW(),1),$K$6:INDEX($K:$K,ROW(),1),IF(MONTH(tblData[[#This Row],[FECHA]])=12,13,MONTH(tblData[[#This Row],[FECHA]])+1)),\"\")","v":{"v":14600,"d":"14,600.00 €"}},{"$f":"IFERROR(TREND($M$6:INDEX($M:$M,ROW(),1),$I$6:INDEX($I:$I,ROW(),1),IF(tblData[[#This Row],[TRIMESTRE]]=4,5,tblData[[#This Row],[TRIMESTRE]]+1)),\"\")","v":{"v":50800,"d":"50,800.00 €"}},{"$f":"IFERROR(TREND($N$6:INDEX($N:$N,ROW(),1),$J$6:INDEX($J:$J,ROW(),1),tblData[[#This Row],[AÑO]]+1),\"\")","v":{"v":143800,"d":"143,800.00 €"}}]
[null,{"$f":"40659+(365*2)","v":"2013-04-25"},"Contoso Pharmaceuticals",{"v":8200,"d":"8,200.00 €"},{"v":8000,"d":"8,000.00 €"},{"v":6400,"d":"6,400.00 €"},{"$f":"tblData[[#This Row],[CANTIDAD]]-tblData[[#This Row],[COSTE]]","v":{"v":1800,"d":"1,800.00 €"}},{"$f":"DATE(YEAR('Entrada datos'!$B7),MONTH('Entrada datos'!$B7),1)","v":"2013-04-01"},{"$f":"LOOKUP(MONTH('Entrada datos'!$H7),{1,1;2,1;3,1;4,2;5,2;6,2;7,3;8,3;9,3;10,4;11,4;12,4})","v":{"v":2,"d":"Trimestre 2"}},{"$f":"YEAR('Entrada datos'!$B7)","v":2013},{"$f":"MONTH(tblData[[#This Row],[FECHA]])","v":4},{"$f":"SUMIFS(tblData[CANTIDAD],tblData[FECHA],\">=\"&EOMONTH(tblData[[#This Row],[FECHA]],-1)+1,tblData[FECHA],\"<=\"&EOMONTH(tblData[[#This Row],[FECHA]],0))","v":{"v":14600,"d":"14,600.00 €"}},{"$f":"SUMIFS(tblData[CANTIDAD],tblData[FECHA],\">=\"&DATE(YEAR(tblData[[#This Row],[FECHA]]),1,1),tblData[FECHA],\"<=\"&DATE(YEAR(tblData[[#This Row],[FECHA]]),12,31),tblData[TRIMESTRE],tblData[[#This Row],[TRIMESTRE]])","v":{"v":50800,"d":"50,800.00 €"}},{"$f":"SUMIFS(tblData[CANTIDAD],tblData[FECHA],\">=\"&DATE(YEAR(tblData[[#This Row],[FECHA]]),1,1),tblData[FECHA],\"<=\"&DATE(YEAR(tblData[[#This Row],[FECHA]]),12,31))","v":{"v":143800,"d":"143,800.00 €"}},{"$f":"IFERROR(TREND($L$6:INDEX($L:$L,ROW(),1),$K$6:INDEX($K:$K,ROW(),1),IF(MONTH(tblData[[#This Row],[FECHA]])=12,13,MONTH(tblData[[#This Row],[FECHA]])+1)),\"\")","v":{"v":14600,"d":"14,600.00 €"}},{"$f":"IFERROR(TREND($M$6:INDEX($M:$M,ROW(),1),$I$6:INDEX($I:$I,ROW(),1),IF(tblData[[#This Row],[TRIMESTRE]]=4,5,tblData[[#This Row],[TRIMESTRE]]+1)),\"\")","v":{"v":50800,"d":"50,800.00 €"}},{"$f":"IFERROR(TREND($N$6:INDEX($N:$N,ROW(),1),$J$6:INDEX($J:$J,ROW(),1),tblData[[#This Row],[AÑO]]+1),\"\")","v":{"v":143800,"d":"143,800.00 €"}}]
[null,{"$f":"40671+(365*2)","v":"2013-05-07"},"Consolidated Messenger",{"v":4400,"d":"4,400.00 €"},{"v":4200,"d":"4,200.00 €"},{"v":2600,"d":"2,600.00 €"},{"$f":"tblData[[#This Row],[CANTIDAD]]-tblData[[#This Row],[COSTE]]","v":{"v":1800,"d":"1,800.00 €"}},{"$f":"DATE(YEAR('Entrada datos'!$B8),MONTH('Entrada datos'!$B8),1)","v":"2013-05-01"},{"$f":"LOOKUP(MONTH('Entrada datos'!$H8),{1,1;2,1;3,1;4,2;5,2;6,2;7,3;8,3;9,3;10,4;11,4;12,4})","v":{"v":2,"d":"Trimestre 2"}},{"$f":"YEAR('Entrada datos'!$B8)","v":2013},{"$f":"MONTH(tblData[[#This Row],[FECHA]])","v":5},{"$f":"SUMIFS(tblData[CANTIDAD],tblData[FECHA],\">=\"&EOMONTH(tblData[[#This Row],[FECHA]],-1)+1,tblData[FECHA],\"<=\"&EOMONTH(tblData[[#This Row],[FECHA]],0))","v":{"v":21800,"d":"21,800.00 €"}},{"$f":"SUMIFS(tblData[CANTIDAD],tblData[FECHA],\">=\"&DATE(YEAR(tblData[[#This Row],[FECHA]]),1,1),tblData[FECHA],\"<=\"&DATE(YEAR(tblData[[#This Row],[FECHA]]),12,31),tblData[TRIMESTRE],tblData[[#This Row],[TRIMESTRE]])","v":{"v":50800,"d":"50,800.00 €"}},{"$f":"SUMIFS(tblData[CANTIDAD],tblData[FECHA],\">=\"&DATE(YEAR(tblData[[#This Row],[FECHA]]),1,1),tblData[FECHA],\"<=\"&DATE(YEAR(tblData[[#This Row],[FECHA]]),12,31))","v":{"v":143800,"d":"143,800.00 €"}},{"$f":"IFERROR(TREND($L$6:INDEX($L:$L,ROW(),1),$K$6:INDEX($K:$K,ROW(),1),IF(MONTH(tblData[[#This Row],[FECHA]])=12,13,MONTH(tblData[[#This Row],[FECHA]])+1)),\"\")","v":{"v":28999.999999999996,"d":"29,000.00 €"}},{"$f":"IFERROR(TREND($M$6:INDEX($M:$M,ROW(),1),$I$6:INDEX($I:$I,ROW(),1),IF(tblData[[#This Row],[TRIMESTRE]]=4,5,tblData[[#This Row],[TRIMESTRE]]+1)),\"\")","v":{"v":50800,"d":"50,800.00 €"}},{"$f":"IFERROR(TREND($N$6:INDEX($N:$N,ROW(),1),$J$6:INDEX($J:$J,ROW(),1),tblData[[#This Row],[AÑO]]+1),\"\")","v":{"v":143800,"d":"143,800.00 €"}}]
[null,{"$f":"40678+(365*2)","v":"2013-05-14"},"Proseware, Inc.",{"v":5400,"d":"5,400.00 €"},{"v":5500,"d":"5,500.00 €"},{"v":4500,"d":"4,500.00 €"},{"$f":"tblData[[#This Row],[CANTIDAD]]-tblData[[#This Row],[COSTE]]","v":{"v":900,"d":"900.00 €"}},{"$f":"DATE(YEAR('Entrada datos'!$B9),MONTH('Entrada datos'!$B9),1)","v":"2013-05-01"},{"$f":"LOOKUP(MONTH('Entrada datos'!$H9),{1,1;2,1;3,1;4,2;5,2;6,2;7,3;8,3;9,3;10,4;11,4;12,4})","v":{"v":2,"d":"Trimestre 2"}},{"$f":"YEAR('Entrada datos'!$B9)","v":2013},{"$f":"MONTH(tblData[[#This Row],[FECHA]])","v":5},{"$f":"SUMIFS(tblData[CANTIDAD],tblData[FECHA],\">=\"&EOMONTH(tblData[[#This Row],[FECHA]],-1)+1,tblData[FECHA],\"<=\"&EOMONTH(tblData[[#This Row],[FECHA]],0))","v":{"v":21800,"d":"21,800.00 €"}},{"$f":"SUMIFS(tblData[CANTIDAD],tblData[FECHA],\">=\"&DATE(YEAR(tblData[[#This Row],[FECHA]]),1,1),tblData[FECHA],\"<=\"&DATE(YEAR(tblData[[#This Row],[FECHA]]),12,31),tblData[TRIMESTRE],tblData[[#This Row],[TRIMESTRE]])","v":{"v":50800,"d":"50,800.00 €"}},{"$f":"SUMIFS(tblData[CANTIDAD],tblData[FECHA],\">=\"&DATE(YEAR(tblData[[#This Row],[FECHA]]),1,1),tblData[FECHA],\"<=\"&DATE(YEAR(tblData[[#This Row],[FECHA]]),12,31))","v":{"v":143800,"d":"143,800.00 €"}},{"$f":"IFERROR(TREND($L$6:INDEX($L:$L,ROW(),1),$K$6:INDEX($K:$K,ROW(),1),IF(MONTH(tblData[[#This Row],[FECHA]])=12,13,MONTH(tblData[[#This Row],[FECHA]])+1)),\"\")","v":{"v":29000,"d":"29,000.00 €"}},{"$f":"IFERROR(TREND($M$6:INDEX($M:$M,ROW(),1),$I$6:INDEX($I:$I,ROW(),1),IF(tblData[[#This Row],[TRIMESTRE]]=4,5,tblData[[#This Row],[TRIMESTRE]]+1)),\"\")","v":{"v":50800,"d":"50,800.00 €"}},{"$f":"IFERROR(TREND($N$6:INDEX($N:$N,ROW(),1),$J$6:INDEX($J:$J,ROW(),1),tblData[[#This Row],[AÑO]]+1),\"\")","v":{"v":143800,"d":"143,800.00 €"}}]
[null,{"$f":"40678+(365*2)","v":"2013-05-14"},"School of Fine Art",{"v":5800,"d":"5,800.00 €"},{"v":6000,"d":"6,000.00 €"},{"v":4500,"d":"4,500.00 €"},{"$f":"tblData[[#This Row],[CANTIDAD]]-tblData[[#This Row],[COSTE]]","v":{"v":1300,"d":"1,300.00 €"}},{"$f":"DATE(YEAR('Entrada datos'!$B10),MONTH('Entrada datos'!$B10),1)","v":"2013-05-01"},{"$f":"LOOKUP(MONTH('Entrada datos'!$H10),{1,1;2,1;3,1;4,2;5,2;6,2;7,3;8,3;9,3;10,4;11,4;12,4})","v":{"v":2,"d":"Trimestre 2"}},{"$f":"YEAR('Entrada datos'!$B10)","v":2013},{"$f":"MONTH(tblData[[#This Row],[FECHA]])","v":5},{"$f":"SUMIFS(tblData[CANTIDAD],tblData[FECHA],\">=\"&EOMONTH(tblData[[#This Row],[FECHA]],-1)+1,tblData[FECHA],\"<=\"&EOMONTH(tblData[[#This Row],[FECHA]],0))","v":{"v":21800,"d":"21,800.00 €"}},{"$f":"SUMIFS(tblData[CANTIDAD],tblData[FECHA],\">=\"&DATE(YEAR(tblData[[#This Row],[FECHA]]),1,1),tblData[FECHA],\"<=\"&DATE(YEAR(tblData[[#This Row],[FECHA]]),12,31),tblData[TRIMESTRE],tblData[[#This Row],[TRIMESTRE]])","v":{"v":50800,"d":"50,800.00 €"}},{"$f":"SUMIFS(tblData[CANTIDAD],tblData[FECHA],\">=\"&DATE(YEAR(tblData[[#This Row],[FECHA]]),1,1),tblData[FECHA],\"<=\"&DATE(YEAR(tblData[[#This Row],[FECHA]]),12,31))","v":{"v":143800,"d":"143,800.00 €"}},{"$f":"IFERROR(TREND($L$6:INDEX($L:$L,ROW(),1),$K$6:INDEX($K:$K,ROW(),1),IF(MONTH(tblData[[#This Row],[FECHA]])=12,13,MONTH(tblData[[#This Row],[FECHA]])+1)),\"\")","v":{"v":29000,"d":"29,000.00 €"}},{"$f":"IFERROR(TREND($M$6:INDEX($M:$M,ROW(),1),$I$6:INDEX($I:$I,ROW(),1),IF(tblData[[#This Row],[TRIMESTRE]]=4,5,tblData[[#This Row],[TRIMESTRE]]+1)),\"\")","v":{"v":50800,"d":"50,800.00 €"}},{"$f":"IFERROR(TREND($N$6:INDEX($N:$N,ROW(),1),$J$6:INDEX($J:$J,ROW(),1),tblData[[#This Row],[AÑO]]+1),\"\")","v":{"v":143800,"d":"143,800.00 €"}}]
[null,{"$f":"40693+(365*2)","v":"2013-05-29"},"Trey Research",{"v":6200,"d":"6,200.00 €"},{"v":6000,"d":"6,000.00 €"},{"v":4500,"d":"4,500.00 €"},{"$f":"tblData[[#This Row],[CANTIDAD]]-tblData[[#This Row],[COSTE]]","v":{"v":1700,"d":"1,700.00 €"}},{"$f":"DATE(YEAR('Entrada datos'!$B11),MONTH('Entrada datos'!$B11),1)","v":"2013-05-01"},{"$f":"LOOKUP(MONTH('Entrada datos'!$H11),{1,1;2,1;3,1;4,2;5,2;6,2;7,3;8,3;9,3;10,4;11,4;12,4})","v":{"v":2,"d":"Trimestre 2"}},{"$f":"YEAR('Entrada datos'!$B11)","v":2013},{"$f":"MONTH(tblData[[#This Row],[FECHA]])","v":5},{"$f":"SUMIFS(tblData[CANTIDAD],tblData[FECHA],\">=\"&EOMONTH(tblData[[#This Row],[FECHA]],-1)+1,tblData[FECHA],\"<=\"&EOMONTH(tblData[[#This Row],[FECHA]],0))","v":{"v":21800,"d":"21,800.00 €"}},{"$f":"SUMIFS(tblData[CANTIDAD],tblData[FECHA],\">=\"&DATE(YEAR(tblData[[#This Row],[FECHA]]),1,1),tblData[FECHA],\"<=\"&DATE(YEAR(tblData[[#This Row],[FECHA]]),12,31),tblData[TRIMESTRE],tblData[[#This Row],[TRIMESTRE]])","v":{"v":50800,"d":"50,800.00 €"}},{"$f":"SUMIFS(tblData[CANTIDAD],tblData[FECHA],\">=\"&DATE(YEAR(tblData[[#This Row],[FECHA]]),1,1),tblData[FECHA],\"<=\"&DATE(YEAR(tblData[[#This Row],[FECHA]]),12,31))","v":{"v":143800,"d":"143,800.00 €"}},{"$f":"IFERROR(TREND($L$6:INDEX($L:$L,ROW(),1),$K$6:INDEX($K:$K,ROW(),1),IF(MONTH(tblData[[#This Row],[FECHA]])=12,13,MONTH(tblData[[#This Row],[FECHA]])+1)),\"\")","v":{"v":29000,"d":"29,000.00 €"}},{"$f":"IFERROR(TREND($M$6:INDEX($M:$M,ROW(),1),$I$6:INDEX($I:$I,ROW(),1),IF(tblData[[#This Row],[TRIMESTRE]]=4,5,tblData[[#This Row],[TRIMESTRE]]+1)),\"\")","v":{"v":50800,"d":"50,800.00 €"}},{"$f":"IFERROR(TREND($N$6:INDEX($N:$N,ROW(),1),$J$6:INDEX($J:$J,ROW(),1),tblData[[#This Row],[AÑO]]+1),\"\")","v":{"v":143800,"d":"143,800.00 €"}}]
[null,{"$f":"40705+(365*2)","v":"2013-06-10"},"A. Datum Corporation",{"v":6900,"d":"6,900.00 €"},{"v":7500,"d":"7,500.00 €"},{"v":5400,"d":"5,400.00 €"},{"$f":"tblData[[#This Row],[CANTIDAD]]-tblData[[#This Row],[COSTE]]","v":{"v":1500,"d":"1,500.00 €"}},{"$f":"DATE(YEAR('Entrada datos'!$B12),MONTH('Entrada datos'!$B12),1)","v":"2013-06-01"},{"$f":"LOOKUP(MONTH('Entrada datos'!$H12),{1,1;2,1;3,1;4,2;5,2;6,2;7,3;8,3;9,3;10,4;11,4;12,4})","v":{"v":2,"d":"Trimestre 2"}},{"$f":"YEAR('Entrada datos'!$B12)","v":2013},{"$f":"MONTH(tblData[[#This Row],[FECHA]])","v":6},{"$f":"SUMIFS(tblData[CANTIDAD],tblData[FECHA],\">=\"&EOMONTH(tblData[[#This Row],[FECHA]],-1)+1,tblData[FECHA],\"<=\"&EOMONTH(tblData[[#This Row],[FECHA]],0))","v":{"v":14400,"d":"14,400.00 €"}},{"$f":"SUMIFS(tblData[CANTIDAD],tblData[FECHA],\">=\"&DATE(YEAR(tblData[[#This Row],[FECHA]]),1,1),tblData[FECHA],\"<=\"&DATE(YEAR(tblData[[#This Row],[FECHA]]),12,31),tblData[TRIMESTRE],tblData[[#This Row],[TRIMESTRE]])","v":{"v":50800,"d":"50,800.00 €"}},{"$f":"SUMIFS(tblData[CANTIDAD],tblData[FECHA],\">=\"&DATE(YEAR(tblData[[#This Row],[FECHA]]),1,1),tblData[FECHA],\"<=\"&DATE(YEAR(tblData[[#This Row],[FECHA]]),12,31))","v":{"v":143800,"d":"143,800.00 €"}},{"$f":"IFERROR(TREND($L$6:INDEX($L:$L,ROW(),1),$K$6:INDEX($K:$K,ROW(),1),IF(MONTH(tblData[[#This Row],[FECHA]])=12,13,MONTH(tblData[[#This Row],[FECHA]])+1)),\"\")","v":{"v":21600.000000000004,"d":"21,600.00 €"}},{"$f":"IFERROR(TREND($M$6:INDEX($M:$M,ROW(),1),$I$6:INDEX($I:$I,ROW(),1),IF(tblData[[#This Row],[TRIMESTRE]]=4,5,tblData[[#This Row],[TRIMESTRE]]+1)),\"\")","v":{"v":50800,"d":"50,800.00 €"}},{"$f":"IFERROR(TREND($N$6:INDEX($N:$N,ROW(),1),$J$6:INDEX($J:$J,ROW(),1),tblData[[#This Row],[AÑO]]+1),\"\")","v":{"v":143800,"d":"143,800.00 €"}}]
[null,{"$f":"40716+(365*2)","v":"2013-06-21"},"Contoso Pharmaceuticals",{"v":7500,"d":"7,500.00 €"},{"v":7200,"d":"7,200.00 €"},{"v":6500,"d":"6,500.00 €"},{"$f":"tblData[[#This Row],[CANTIDAD]]-tblData[[#This Row],[COSTE]]","v":{"v":1000,"d":"1,000.00 €"}},{"$f":"DATE(YEAR('Entrada datos'!$B13),MONTH('Entrada datos'!$B13),1)","v":"2013-06-01"},{"$f":"LOOKUP(MONTH('Entrada datos'!$H13),{1,1;2,1;3,1;4,2;5,2;6,2;7,3;8,3;9,3;10,4;11,4;12,4})","v":{"v":2,"d":"Trimestre 2"}},{"$f":"YEAR('Entrada datos'!$B13)","v":2013},{"$f":"MONTH(tblData[[#This Row],[FECHA]])","v":6},{"$f":"SUMIFS(tblData[CANTIDAD],tblData[FECHA],\">=\"&EOMONTH(tblData[[#This Row],[FECHA]],-1)+1,tblData[FECHA],\"<=\"&EOMONTH(tblData[[#This Row],[FECHA]],0))","v":{"v":14400,"d":"14,400.00 €"}},{"$f":"SUMIFS(tblData[CANTIDAD],tblData[FECHA],\">=\"&DATE(YEAR(tblData[[#This Row],[FECHA]]),1,1),tblData[FECHA],\"<=\"&DATE(YEAR(tblData[[#This Row],[FECHA]]),12,31),tblData[TRIMESTRE],tblData[[#This Row],[TRIMESTRE]])","v":{"v":50800,"d":"50,800.00 €"}},{"$f":"SUMIFS(tblData[CANTIDAD],tblData[FECHA],\">=\"&DATE(YEAR(tblData[[#This Row],[FECHA]]),1,1),tblData[FECHA],\"<=\"&DATE(YEAR(tblData[[#This Row],[FECHA]]),12,31))","v":{"v":143800,"d":"143,800.00 €"}},{"$f":"IFERROR(TREND($L$6:INDEX($L:$L,ROW(),1),$K$6:INDEX($K:$K,ROW(),1),IF(MONTH(tblData[[#This Row],[FECHA]])=12,13,MONTH(tblData[[#This Row],[FECHA]])+1)),\"\")","v":{"v":17950,"d":"17,950.00 €"}},{"$f":"IFERROR(TREND($M$6:INDEX($M:$M,ROW(),1),$I$6:INDEX($I:$I,ROW(),1),IF(tblData[[#This Row],[TRIMESTRE]]=4,5,tblData[[#This Row],[TRIMESTRE]]+1)),\"\")","v":{"v":50800,"d":"50,800.00 €"}},{"$f":"IFERROR(TREND($N$6:INDEX($N:$N,ROW(),1),$J$6:INDEX($J:$J,ROW(),1),tblData[[#This Row],[AÑO]]+1),\"\")","v":{"v":143800,"d":"143,800.00 €"}}]
[null,{"$f":"40731+(365*2)","v":"2013-07-06"},"Consolidated Messenger",{"v":8700,"d":"8,700.00 €"},{"v":8500,"d":"8,500.00 €"},{"v":7250,"d":"7,250.00 €"},{"$f":"tblData[[#This Row],[CANTIDAD]]-tblData[[#This Row],[COSTE]]","v":{"v":1450,"d":"1,450.00 €"}},{"$f":"DATE(YEAR('Entrada datos'!$B14),MONTH('Entrada datos'!$B14),1)","v":"2013-07-01"},{"$f":"LOOKUP(MONTH('Entrada datos'!$H14),{1,1;2,1;3,1;4,2;5,2;6,2;7,3;8,3;9,3;10,4;11,4;12,4})","v":{"v":3,"d":"Trimestre 3"}},{"$f":"YEAR('Entrada datos'!$B14)","v":2013},{"$f":"MONTH(tblData[[#This Row],[FECHA]])","v":7},{"$f":"SUMIFS(tblData[CANTIDAD],tblData[FECHA],\">=\"&EOMONTH(tblData[[#This Row],[FECHA]],-1)+1,tblData[FECHA],\"<=\"&EOMONTH(tblData[[#This Row],[FECHA]],0))","v":{"v":8700,"d":"8,700.00 €"}},{"$f":"SUMIFS(tblData[CANTIDAD],tblData[FECHA],\">=\"&DATE(YEAR(tblData[[#This Row],[FECHA]]),1,1),tblData[FECHA],\"<=\"&DATE(YEAR(tblData[[#This Row],[FECHA]]),12,31),tblData[TRIMESTRE],tblData[[#This Row],[TRIMESTRE]])","v":{"v":49100,"d":"49,100.00 €"}},{"$f":"SUMIFS(tblData[CANTIDAD],tblData[FECHA],\">=\"&DATE(YEAR(tblData[[#This Row],[FECHA]]),1,1),tblData[FECHA],\"<=\"&DATE(YEAR(tblData[[#This Row],[FECHA]]),12,31))","v":{"v":143800,"d":"143,800.00 €"}},{"$f":"IFERROR(TREND($L$6:INDEX($L:$L,ROW(),1),$K$6:INDEX($K:$K,ROW(),1),IF(MONTH(tblData[[#This Row],[FECHA]])=12,13,MONTH(tblData[[#This Row],[FECHA]])+1)),\"\")","v":{"v":10776.470588235294,"d":"10,776.47 €"}},{"$f":"IFERROR(TREND($M$6:INDEX($M:$M,ROW(),1),$I$6:INDEX($I:$I,ROW(),1),IF(tblData[[#This Row],[TRIMESTRE]]=4,5,tblData[[#This Row],[TRIMESTRE]]+1)),\"\")","v":{"v":47400,"d":"47,400.00 €"}},{"$f":"IFERROR(TREND($N$6:INDEX($N:$N,ROW(),1),$J$6:INDEX($J:$J,ROW(),1),tblData[[#This Row],[AÑO]]+1),\"\")","v":{"v":143800,"d":"143,800.00 €"}}]
[null,{"$f":"40761+(365*2)","v":"2013-08-05"},"Proseware, Inc.",{"v":8500,"d":"8,500.00 €"},{"v":8300,"d":"8,300.00 €"},{"v":7100,"d":"7,100.00 €"},{"$f":"tblData[[#This Row],[CANTIDAD]]-tblData[[#This Row],[COSTE]]","v":{"v":1400,"d":"1,400.00 €"}},{"$f":"DATE(YEAR('Entrada datos'!$B15),MONTH('Entrada datos'!$B15),1)","v":"2013-08-01"},{"$f":"LOOKUP(MONTH('Entrada datos'!$H15),{1,1;2,1;3,1;4,2;5,2;6,2;7,3;8,3;9,3;10,4;11,4;12,4})","v":{"v":3,"d":"Trimestre 3"}},{"$f":"YEAR('Entrada datos'!$B15)","v":2013},{"$f":"MONTH(tblData[[#This Row],[FECHA]])","v":8},{"$f":"SUMIFS(tblData[CANTIDAD],tblData[FECHA],\">=\"&EOMONTH(tblData[[#This Row],[FECHA]],-1)+1,tblData[FECHA],\"<=\"&EOMONTH(tblData[[#This Row],[FECHA]],0))","v":{"v":16400,"d":"16,400.00 €"}},{"$f":"SUMIFS(tblData[CANTIDAD],tblData[FECHA],\">=\"&DATE(YEAR(tblData[[#This Row],[FECHA]]),1,1),tblData[FECHA],\"<=\"&DATE(YEAR(tblData[[#This Row],[FECHA]]),12,31),tblData[TRIMESTRE],tblData[[#This Row],[TRIMESTRE]])","v":{"v":49100,"d":"49,100.00 €"}},{"$f":"SUMIFS(tblData[CANTIDAD],tblData[FECHA],\">=\"&DATE(YEAR(tblData[[#This Row],[FECHA]]),1,1),tblData[FECHA],\"<=\"&DATE(YEAR(tblData[[#This Row],[FECHA]]),12,31))","v":{"v":143800,"d":"143,800.00 €"}},{"$f":"IFERROR(TREND($L$6:INDEX($L:$L,ROW(),1),$K$6:INDEX($K:$K,ROW(),1),IF(MONTH(tblData[[#This Row],[FECHA]])=12,13,MONTH(tblData[[#This Row],[FECHA]])+1)),\"\")","v":{"v":12455.862068965516,"d":"12,455.86 €"}},{"$f":"IFERROR(TREND($M$6:INDEX($M:$M,ROW(),1),$I$6:INDEX($I:$I,ROW(),1),IF(tblData[[#This Row],[TRIMESTRE]]=4,5,tblData[[#This Row],[TRIMESTRE]]+1)),\"\")","v":{"v":47400,"d":"47,400.00 €"}},{"$f":"IFERROR(TREND($N$6:INDEX($N:$N,ROW(),1),$J$6:INDEX($J:$J,ROW(),1),tblData[[#This Row],[AÑO]]+1),\"\")","v":{"v":143800,"d":"143,800.00 €"}}]
{"$rows_left_out":10}
{"sheet":"Informe de ventas","index":1,"n_rows":28,"n_cols":6,"rows_kept":28}
[]
[null,"MENSUAL INFORME VENTAS"]
[]
[]
[null,"AÑO","TRIMESTRE","MES","COMPAÑÍA","VENTAS TOTALES"]
[null,2013,{"v":2,"d":"Trimestre 2"},"2013-04-01","A. Datum Corporation",{"v":6400,"d":"6,400.00 €"}]
[{"$nulls":4},"Contoso Pharmaceuticals",{"v":8200,"d":"8,200.00 €"}]
[{"$nulls":3},"2013-05-01","Consolidated Messenger",{"v":4400,"d":"4,400.00 €"}]
[{"$nulls":4},"Proseware, Inc.",{"v":5400,"d":"5,400.00 €"}]
[{"$nulls":4},"School of Fine Art",{"v":5800,"d":"5,800.00 €"}]
[{"$nulls":4},"Trey Research",{"v":6200,"d":"6,200.00 €"}]
[{"$nulls":3},"2013-06-01","A. Datum Corporation",{"v":6900,"d":"6,900.00 €"}]
[{"$nulls":4},"Contoso Pharmaceuticals",{"v":7500,"d":"7,500.00 €"}]
[null,null,"Total Trimestre 2",null,null,{"v":50800,"d":"50,800.00 €"}]
[null,null,{"v":3,"d":"Trimestre 3"},"2013-07-01","Consolidated Messenger",{"v":8700,"d":"8,700.00 €"}]
{"$rows_left_out":14}
{"sheet":"Previsión de ventas","index":2,"n_rows":43,"n_cols":10,"rows_kept":43}
[]
[null,"MENSUAL PREVISIONES VENTAS"]
[null,{"$f":"\"FECHA ACTUAL: \"&UPPER(TEXT(TODAY(),\"d mmm, aaaa\"))","v":"FECHA ACTUAL: 31 AGO, 2012"},null,{"$f":"--TRIM(RIGHT(B3,LEN(B3)-FIND(\":\",B3)))","v":"2012-08-31"}]
[]
[null,"ESTE MES","REALES","PLANEADAS","VARIACIÓN","%","REALES HASTA LA FECHA","PLANEADAS HASTA AL FECHA","VARIACIÓN HASTA LA FECHA","Hasta la fecha %"]
[null,"Cantidad",{"$f":"COUNTIF('Entrada datos'!$B$6:$B$24,\">=\"&DATE(fYear,MONTH(fDate),1))-COUNTIF('Entrada datos'!$B$6:$B$24,\">\"&EOMONTH(fDate,0))","v":0},{"$nulls":3},{"$f":"COUNTIF(tblData[FECHA],\"<=\"&EOMONTH(fDate,0))","v":0}]
[null,"Ventas",{"$f":"SUMIF(tblData[FECHA],\">=\"&DATE(fYear,MONTH(fDate),1),tblData[CANTIDAD])-SUMIF(tblData[FECHA],\">\"&EOMONTH(fDate,0),tblData[CANTIDAD])","v":{"v":0,"d":"0.00 €"}},{"$f":"SUMIF('Entrada datos'!$B$6:$B$24,\">=\"&DATE(fYear,MONTH(fDate),1),'Entrada datos'!$E$6:$E$24)-SUMIF('Entrada datos'!$B$6:$B$24,\">\"&EOMONTH(fDate,0),'Entrada datos'!$E$6:$E$24)","v":{"v":0,"d":"0.00 €"}},{"$f":"D7-C7","v":{"v":0,"d":"0.00 €"}},{"$f":"IFERROR(D7/C7,\"-\")","v":"-"},{"$f":"SUMIF(tblData[FECHA],\"<=\"&EOMONTH(fDate,0),tblData[CANTIDAD])","v":{"v":0,"d":"0.00 €"}},{"$f":"SUMIF(tblData[FECHA],\"<=\"&EOMONTH(fDate,0),tblData[PLANEADA])","v":{"v":0,"d":"0.00 €"}},{"$f":"H7-G7","v":{"v":0,"d":"0.00 €"}},{"$f":"IFERROR(H7/G7,\"\")","v":""}]
[null,"Ingresos",{"$f":"(SUMIF(tblData[FECHA],\">=\"&DATE(fYear,MONTH(fDate),1),tblData[CANTIDAD])-SUMIF(tblData[FECHA],\">\"&EOMONTH(fDate,0),tblData[CANTIDAD]))-(SUMIF(tblData[FECHA],\">=\"&DATE(fYear,MONTH(fDate),1),tblData[COSTE])-SUMIF(tblData[FECHA],\">\"&EOMONTH(fDate,0),tblData[COSTE]))","v":{"v":0,"d":"0.00 €"}},{"$f":"(SUMIF('Entrada datos'!$B$6:$B$24,\">=\"&DATE(fYear,MONTH(fDate),1),'Entrada datos'!$E$6:$E$24)-SUMIF('Entrada datos'!$B$6:$B$24,\">\"&EOMONTH(fDate,0),'Entrada datos'!$E$6:$E$24))-(SUMIF('Entrada datos'!$B$6:$B$24,\">=\"&DATE(fYear,MONTH(fDate),1),'Entrada datos'!$F$6:$F$24)-SUMIF('Entrada datos'!$B$6:$B$24,\">\"&EOMONTH(fDate,0),'Entrada datos'!$F$6:$F$24))","v":{"v":0,"d":"0.00 €"}},{"$f":"D8-C8","v":{"v":0,"d":"0.00 €"}},{"$f":"IFERROR(D8/C8,\"-\")","v":"-"},{"$f":"SUMIF('Entrada datos'!$B$6:$B$24,\"<=\"&EOMONTH(fDate,0),'Entrada datos'!$F$6:$F$24)","v":{"v":0,"d":"0.00 €"}},{"$f":"SUMIF(tblData[FECHA],\"<=\"&EOMONTH(fDate,0),tblData[COSTE])","v":{"v":0,"d":"0.00 €"}},{"$f":"H8-G8","v":{"v":0,"d":"0.00 €"}},{"$f":"IFERROR(H8/G8,\"\")","v":""}]
[null,"Margen",{"$f":"IFERROR(C8/C7,\"-\")","v":"-"},{"$f":"IFERROR(D8/D7,\"-\")","v":"-"},null,{"$f":"IFERROR(F8/F7,\"-\")","v":"-"},{"$f":"IFERROR(G8/G7,\"\")","v":""},{"$f":"IFERROR(H8/H7,\"\")","v":""},null,{"$f":"IFERROR(J8/J7,\"\")","v":""}]
[null,"Número de pedidos",{"$f":"COUNTIF(tblData[FECHA],\">=\"&DATE(fYear,MONTH(fDate),1))-COUNTIF(tblData[FECHA],\">\"&EOMONTH(fDate,0))","v":0},{"$nulls":3},{"$f":"COUNTIF(tblData[FECHA],\">\"&EOMONTH(fDate,0))","v":19}]
[null,"Valor medio de pedidos",{"$f":"IFERROR(C7/C10,\"-\")","v":"-"},{"$nulls":3},{"$f":"IFERROR(G7/G10,\"-\")","v":{"v":0,"d":"0.00 €"}}]
[]
[null,"PREVISIÓN",null,"PRÓX. MES",null,"PRÓX. TRIMESTRE",null,null,"PRÓX. AÑO"]
[null,"Ventas",null,{"$f":"TREND(tblData[[MES ]],tblData[Nº MES (OCULTAR)],IF(MONTH(fDate)=12,13,MONTH(fDate)+1))","v":{"v":19101.09983079526,"d":"19,101.10 €"}},null,{"$f":"TREND(tblData[[TRIMESTRE ]],tblData[Nº MES (OCULTAR)],IF(MONTH(fDate)=12,13,MONTH(fDate)+1))","v":{"v":47090.52453468698,"d":"47,090.52 €"}},null,null,{"$f":"TREND(tblData[[ANUAL ]],tblData[Nº MES (OCULTAR)],IF(MONTH(fDate)=12,13,MONTH(fDate)+1))","v":{"v":143800,"d":"143,800.00 €"}}]
[]
{"$rows_left_out":10}