{"text_format":"3","workbook":"xlsx","n_sheets":9,"sheets":["Resumen","Clase 1","Clase 2","Clase 3","Clase 4","Clase 5","Clase 6","Clase 7","Tabla de calificaciones"],"not_rendered":{"defined_names":9},"read":"whole","date_system":"1900"}

{"sheet":"Resumen","index":0,"n_rows":12,"n_cols":7,"rows_kept":12,"merged":[[1,1,1,2]]}
[]
[null,"Nombre del colegio",null,"  Su nombre:",null," Semestre y año:"]
[]
[null,"Clases","Créditos","Porcentaje actual","Calificación","Nota media","Nota media ponderada"]
[null,"Clase 1",{"v":3,"d":"3.0"},{"$f":"'Clase 1'!D$36","v":{"v":0.8661764705882353,"d":"86.62%"}},{"$f":"IF(D5<>\"\",HLOOKUP(D5,'Tabla de calificaciones'!$C$5:$O$7,2),\"\")","v":"B"},{"$f":"IF(D5<>\"\",HLOOKUP(D5,'Tabla de calificaciones'!$C$5:$O$7,3),\"\")","v":{"v":3,"d":"3.00"}},{"$f":"IF(F5<>\"\",F5*C5/(SUM($C$5:$C$11)), \"\")","v":{"v":0.5625,"d":"0.56"}}]
[null,"Clase 2",{"v":4,"d":"4.0"},{"$f":"'Clase 2'!D$36","v":""},{"$f":"IF(D6<>\"\",HLOOKUP(D6,'Tabla de calificaciones'!$C$5:$O$7,2),\"\")","v":""},{"$f":"IF(D6<>\"\",HLOOKUP(D6,'Tabla de calificaciones'!$C$5:$O$7,3),\"\")","v":""},""]
[null,"Clase 3",{"v":2,"d":"2.0"},{"$f":"'Clase 3'!D$36","v":""},{"$f":"IF(D7<>\"\",HLOOKUP(D7,'Tabla de calificaciones'!$C$5:$O$7,2),\"\")","v":""},{"$f":"IF(D7<>\"\",HLOOKUP(D7,'Tabla de calificaciones'!$C$5:$O$7,3),\"\")","v":""},""]
[null,"Clase 4",{"v":4,"d":"4.0"},{"$f":"'Clase 4'!D$36","v":""},{"$f":"IF(D8<>\"\",HLOOKUP(D8,'Tabla de calificaciones'!$C$5:$O$7,2),\"\")","v":""},{"$f":"IF(D8<>\"\",HLOOKUP(D8,'Tabla de calificaciones'!$C$5:$O$7,3),\"\")","v":""},""]
[null,"Clase 5",{"v":1,"d":"1.0"},{"$f":"'Clase 5'!D$36","v":""},{"$f":"IF(D9<>\"\",HLOOKUP(D9,'Tabla de calificaciones'!$C$5:$O$7,2),\"\")","v":""},{"$f":"IF(D9<>\"\",HLOOKUP(D9,'Tabla de calificaciones'!$C$5:$O$7,3),\"\")","v":""},""]
[null,"Clase 6",{"v":1,"d":"1.0"},{"$f":"'Clase 6'!D$36","v":""},{"$f":"IF(D10<>\"\",HLOOKUP(D10,'Tabla de calificaciones'!$C$5:$O$7,2),\"\")","v":""},{"$f":"IF(D10<>\"\",HLOOKUP(D10,'Tabla de calificaciones'!$C$5:$O$7,3),\"\")","v":""},""]
[null,"Clase 7",{"v":1,"d":"1.0"},{"$f":"'Clase 7'!D$36","v":""},{"$f":"IF(D11<>\"\",HLOOKUP(D11,'Tabla de calificaciones'!$C$5:$O$7,2),\"\")","v":""},{"$f":"IF(D11<>\"\",HLOOKUP(D11,'Tabla de calificaciones'!$C$5:$O$7,3),\"\")","v":""},""]
[null,"Totales",{"$f":"SUM(C5:C11)","v":16},{"$f":"AVERAGE(D5:D11)","v":{"v":0.8661764705882353,"d":"86.62%"}},{"$f":"IF(D12<>\"\",HLOOKUP(D12,'Tabla de calificaciones'!$C$5:$O$7,2),\"\")","v":"B"},{"$f":"AVERAGE(F5:F11)","v":{"v":3,"d":"3.00"}},{"$f":"SUM(G5:G11)","v":{"v":0.5625,"d":"0.56"}}]

{"sheet":"Clase 1","index":1,"n_rows":38,"n_cols":8,"rows_kept":38,"merged":[[1,1,1,2]]}
[]
[null,{"$f":"Resumen!B5","v":"Clase 1"}]
[null,"Profesor:",null,null,"Porcentaje del número máximo de puntos",null,null,{"$f":"IF(SUM($C$35:$H$35) <> 0,SUM($C$34:$H$34)/SUM($C$35:$H$35),\"\")","v":{"v":0.8661764705882353,"d":"86.62%"}}]
[null,"Correo electrónico:",null,null,"Calificación actual",null,null,{"$f":"SUM($C$34:$H$34)","v":{"v":0.17323529411764707,"d":"17.32%"}}]
[]
[null,"Asignaciones","Trabajos en casa","Redacciones","Cuestionarios","Proyectos","Evaluación parcial","Examen final"]
[null,"Relevancia",{"v":0.1,"d":"10.0%"},{"v":0.1,"d":"10.0%"},{"v":0.15,"d":"15.0%"},{"v":0.15,"d":"15.0%"},{"v":0.2,"d":"20.0%"},{"v":0.3,"d":"30.0%"}]
[null,"Primer trabajo en casa",{"v":0.8823529411764706,"d":"0.88"}]
[null,"Trabajo sobre la II Guerra Mundial",null,0.85]
{"$rows_empty":24}
[null,"Total de puntos",{"$f":"IF(COUNT(C8:C33) <> 0,AVERAGE(C8:C33) *C7, \"\")","v":{"v":0.08823529411764706,"d":"0.0882"}},{"v":0.085,"d":"0.0850"},"","","",""]
[null,"Número máximo de puntos",{"$f":"IF(COUNT(C8:C33)<>0,C7,\"\")","v":0.1},0.1,"","","",""]
[null,"Porcentaje del número máximo de puntos",null,{"$f":"IF(SUM($C$35:$H$35) <> 0,SUM($C$34:$H$34)/SUM($C$35:$H$35),\"\")","v":{"v":0.8661764705882353,"d":"86.62%"}}]
[null,"Para introducir las calificaciones:","Escriba los puntos obtenidos en relación con el número máximo de puntos (p. ej. 15/17)."]
[null,null,"Escriba el porcentaje obtenido (p. ej. 85%)."]

{"sheet":"Clase 2","index":2,"n_rows":38,"n_cols":8,"rows_kept":38,"merged":[[1,1,1,2]]}
[]
[null,{"$f":"Resumen!B6","v":"Clase 2"}]
[null,"Profesor:",null,null,"Porcentaje del número máximo de puntos",null,null,{"$f":"IF(SUM($C$35:$H$35) <> 0,SUM($C$34:$H$34)/SUM($C$35:$H$35),\"\")","v":""}]
[null,"Correo electrónico:",null,null,"Calificación actual",null,null,{"$f":"SUM($C$34:$H$34)","v":{"v":0,"d":"0.00%"}}]
[]
[null,"Asignaciones","Trabajos en casa","Redacciones","Cuestionarios","Proyectos","Evaluación parcial","Examen final"]
[null,"Relevancia",{"v":0.1,"d":"10.0%"},{"v":0.1,"d":"10.0%"},{"v":0.15,"d":"15.0%"},{"v":0.15,"d":"15.0%"},{"v":0.2,"d":"20.0%"},{"v":0.3,"d":"30.0%"}]
{"$rows_empty":26}
[null,"Total de puntos",{"$f":"IF(COUNT(C8:C33) <> 0,AVERAGE(C8:C33) *C7, \"\")","v":""},"","","","",""]
[null,"Número máximo de puntos",{"$f":"IF(COUNT(C8:C33)<>0,C7,\"\")","v":""},"","","","",""]
[null,"Porcentaje del número máximo de puntos",null,{"$f":"IF(SUM($C$35:$H$35) <> 0,SUM($C$34:$H$34)/SUM($C$35:$H$35),\"\")","v":""}]
[null,"Para introducir las calificaciones:","Escriba los puntos obtenidos en relación con el número máximo de puntos (p. ej. 15/17)."]
[null,null,"Escriba el porcentaje obtenido (p. ej. 85%)."]

{"sheet":"Clase 3","index":3,"n_rows":38,"n_cols":8,"rows_kept":38,"merged":[[1,1,1,2]]}
[]
[null,{"$f":"Resumen!B7","v":"Clase 3"}]
[null,"Profesor:",null,null,"Porcentaje del número máximo de puntos",null,null,{"$f":"IF(SUM($C$35:$H$35) <> 0,SUM($C$34:$H$34)/SUM($C$35:$H$35),\"\")","v":""}]
[null,"Correo electrónico:",null,null,"Calificación actual",null,null,{"$f":"SUM($C$34:$H$34)","v":{"v":0,"d":"0.00%"}}]
[]
[null,"Asignaciones","Trabajos en casa","Redacciones","Cuestionarios","Proyectos","Evaluación parcial","Examen final"]
[null,"Relevancia",{"v":0.1,"d":"10.0%"},{"v":0.1,"d":"10.0%"},{"v":0.15,"d":"15.0%"},{"v":0.15,"d":"15.0%"},{"v":0.2,"d":"20.0%"},{"v":0.3,"d":"30.0%"}]
{"$rows_empty":26}
[null,"Total de puntos",{"$f":"IF(COUNT(C8:C33) <> 0,AVERAGE(C8:C33) *C7, \"\")","v":""},"","","","",""]
[null,"Número máximo de puntos",{"$f":"IF(COUNT(C8:C33)<>0,C7,\"\")","v":""},"","","","",""]
[null,"Porcentaje del número máximo de puntos",null,{"$f":"IF(SUM($C$35:$H$35) <> 0,SUM($C$34:$H$34)/SUM($C$35:$H$35),\"\")","v":""}]
[null,"Para introducir las calificaciones:","Escriba los puntos obtenidos en relación con el número máximo de puntos (p. ej. 15/17)."]
[null,null,"Escriba el porcentaje obtenido (p. ej. 85%)."]

{"sheet":"Clase 4","index":4,"n_rows":38,"n_cols":8,"rows_kept":38,"merged":[[1,1,1,2]]}
[]
[null,{"$f":"Resumen!B8","v":"Clase 4"}]
[null,"Profesor:",null,null,"Porcentaje del número máximo de puntos"]
[null,"Correo electrónico:",null,null,"Calificación actual",null,null,{"$f":"SUM($C$34:$H$34)","v":{"v":0,"d":"0.00%"}}]
[]
[null,"Asignaciones","Trabajos en casa","Redacciones","Cuestionarios","Proyectos","Evaluación parcial","Examen final"]
[null,"Relevancia",{"v":0.1,"d":"10.0%"},{"v":0.1,"d":"10.0%"},{"v":0.15,"d":"15.0%"},{"v":0.15,"d":"15.0%"},{"v":0.2,"d":"20.0%"},{"v":0.3,"d":"30.0%"}]
{"$rows_empty":26}
[null,"Total de puntos",{"$f":"IF(COUNT(C8:C33) <> 0,AVERAGE(C8:C33) *C7, \"\")","v":""},"","","","",""]
[null,"Número máximo de puntos",{"$f":"IF(COUNT(C8:C33)<>0,C7,\"\")","v":""},"","","","",""]
[null,"Porcentaje del número máximo de puntos",null,{"$f":"IF(SUM($C$35:$H$35) <> 0,SUM($C$34:$H$34)/SUM($C$35:$H$35),\"\")","v":""}]
[null,"Para introducir las calificaciones:","Escriba los puntos obtenidos en relación con el número máximo de puntos (p. ej. 15/17)."]
[null,null,"Escriba el porcentaje obtenido (p. ej. 85%)."]

{"sheet":"Clase 5","index":5,"n_rows":38,"n_cols":8,"rows_kept":38,"merged":[[1,1,1,2]]}
[]
[null,{"$f":"Resumen!B9","v":"Clase 5"}]
[null,"Profesor:",null,null,"Porcentaje del número máximo de puntos",null,null,{"$f":"IF(SUM($C$35:$H$35) <> 0,SUM($C$34:$H$34)/SUM($C$35:$H$35),\"\")","v":""}]
[null,"Correo electrónico:",null,null,"Calificación actual",null,null,{"$f":"SUM($C$34:$H$34)","v":{"v":0,"d":"0.00%"}}]
[]
[null,"Asignaciones","Trabajos en casa","Redacciones","Cuestionarios","Proyectos","Evaluación parcial","Examen final"]
[null,"Relevancia",{"v":0.1,"d":"10.0%"},{"v":0.1,"d":"10.0%"},{"v":0.15,"d":"15.0%"},{"v":0.15,"d":"15.0%"},{"v":0.2,"d":"20.0%"},{"v":0.3,"d":"30.0%"}]
{"$rows_empty":26}
[null,"Total de puntos",{"$f":"IF(COUNT(C8:C33) <> 0,AVERAGE(C8:C33) *C7, \"\")","v":""},"","","","",""]
[null,"Número máximo de puntos",{"$f":"IF(COUNT(C8:C33)<>0,C7,\"\")","v":""},"","","","",""]
[null,"Porcentaje del número máximo de puntos",null,{"$f":"IF(SUM($C$35:$H$35) <> 0,SUM($C$34:$H$34)/SUM($C$35:$H$35),\"\")","v":""}]
[null,"Para introducir las calificaciones:","Escriba los puntos obtenidos en relación con el número máximo de puntos (p. ej. 15/17)."]
[null,null,"Escriba el porcentaje obtenido (p. ej. 85%)."]

{"sheet":"Clase 6","index":6,"n_rows":38,"n_cols":8,"rows_kept":38,"merged":[[1,1,1,2]]}
[]
[null,{"$f":"Resumen!B10","v":"Clase 6"}]
[null,"Profesor:",null,null,"Porcentaje del número máximo de puntos",null,null,{"$f":"IF(SUM($C$35:$H$35) <> 0,SUM($C$34:$H$34)/SUM($C$35:$H$35),\"\")","v":""}]
[null,"Correo electrónico:",null,null,"Calificación actual",null,null,{"$f":"SUM($C$34:$H$34)","v":{"v":0,"d":"0.00%"}}]
[]
[null,"Asignaciones","Trabajos en casa","Redacciones","Cuestionarios","Proyectos","Evaluación parcial","Examen final"]
[null,"Relevancia",{"v":0.1,"d":"10.0%"},{"v":0.1,"d":"10.0%"},{"v":0.15,"d":"15.0%"},{"v":0.15,"d":"15.0%"},{"v":0.2,"d":"20.0%"},{"v":0.3,"d":"30.0%"}]
{"$rows_empty":26}
[null,"Total de puntos",{"$f":"IF(COUNT(C8:C33) <> 0,AVERAGE(C8:C33) *C7, \"\")","v":""},"","","","",""]
[null,"Número máximo de puntos",{"$f":"IF(COUNT(C8:C33)<>0,C7,\"\")","v":""},"","","","",""]
[null,"Porcentaje del número máximo de puntos",null,{"$f":"IF(SUM($C$35:$H$35) <> 0,SUM($C$34:$H$34)/SUM($C$35:$H$35),\"\")","v":""},{"$f":"IF(SUM($C$35:$H$35) <> 0,SUM($C$34:$H$34)/SUM($C$35:$H$35),\"\")","v":""}]
[null,"Para introducir las calificaciones:","Escriba los puntos obtenidos en relación con el número máximo de puntos (p. ej. 15/17)."]
[null,null,"Escriba el porcentaje obtenido (p. ej. 85%)."]

{"sheet":"Clase 7","index":7,"n_rows":38,"n_cols":8,"rows_kept":38,"merged":[[1,1,1,2]]}
[]
[null,{"$f":"Resumen!B11","v":"Clase 7"}]
[null,"Profesor:",null,null,"Porcentaje del número máximo de puntos",null,null,{"$f":"IF(SUM($C$35:$H$35) <> 0,SUM($C$34:$H$34)/SUM($C$35:$H$35),\"\")","v":""}]
[null,"Correo electrónico:",null,null,"Calificación actual",null,null,{"$f":"SUM($C$34:$H$34)","v":{"v":0,"d":"0.00%"}}]
[]
[null,"Asignaciones","Trabajos en casa","Redacciones","Cuestionarios","Proyectos","Evaluación parcial","Examen final"]
[null,"Relevancia",{"v":0.1,"d":"10.0%"},{"v":0.1,"d":"10.0%"},{"v":0.15,"d":"15.0%"},{"v":0.15,"d":"15.0%"},{"v":0.2,"d":"20.0%"},{"v":0.3,"d":"30.0%"}]
{"$rows_empty":26}
[null,"Total de puntos",{"$f":"IF(COUNT(C8:C33) <> 0,AVERAGE(C8:C33) *C7, \"\")","v":""},"","","","",""]
[null,"Número máximo de puntos",{"$f":"IF(COUNT(C8:C33)<>0,C7,\"\")","v":""},"","","","",""]
[null,"Porcentaje del número máximo de puntos",null,{"$f":"IF(SUM($C$35:$H$35) <> 0,SUM($C$34:$H$34)/SUM($C$35:$H$35),\"\")","v":""}]
[null,"Para introducir las calificaciones:","Escriba los puntos obtenidos en relación con el número máximo de puntos (p. ej. 15/17)."]
[null,null,"Escriba el porcentaje obtenido (p. ej. 85%)."]

{"sheet":"Tabla de calificaciones","index":8,"n_rows":7,"n_cols":15,"rows_kept":7}
[]
[]
[]
[null,"Tabla de calificaciones y notas medias"]
[null,"Promedio",{"v":0,"d":"0%"},{"v":0.6,"d":"60%"},{"v":0.63,"d":"63%"},{"v":0.67,"d":"67%"},{"v":0.7,"d":"70%"},{"v":0.73,"d":"73%"},{"v":0.77,"d":"77%"},{"v":0.8,"d":"80%"},{"v":0.83,"d":"83%"},{"v":0.87,"d":"87%"},{"v":0.9,"d":"90%"},{"v":0.93,"d":"93%"},{"v":0.97,"d":"97%"}]
[null,"Calificación","F","D-","D","D+","C-","C","C+","B-","B","B+","A-","A","A+"]
[null,"Nota media",{"v":0,"d":"0.00"},0.67,{"v":1,"d":"1.00"},1.33,1.67,{"v":2,"d":"2.00"},2.33,2.67,{"v":3,"d":"3.00"},3.33,3.67,{"v":4,"d":"4.00"},{"v":4,"d":"4.00"}]