{"text_format":"3","workbook":"xlsx","n_sheets":3,"sheets":["Bracket","Tracker","Validation"],"not_rendered":{"defined_names":2},"read":"whole","date_system":"1900"}

{"sheet":"Bracket","index":0,"n_rows":66,"n_cols":19,"rows_kept":66,"merged":[[0,1,0,18],[1,9,1,10],[14,9,17,10],[17,4,20,5],[17,14,20,15],[18,6,18,7],[18,12,18,13],[25,8,25,9],[32,5,37,7],[32,9,34,10],[32,12,37,14],[35,9,37,10],[43,10,43,11],[49,4,52,5],[49,14,52,15],[50,6,50,7],[50,12,50,13]]}
[null,"COLLEGE BASKETBALL TOURNAMENT BRACKET"]
[null,null,"2nd Round","3rd Round","4th Round","5th Round",null,"6th Round",null,"Final",null,null,"6th Round",null,"5th Round","4th Round","3rd Round","2nd Round"]
[null,null,"Dates","Dates","Dates","Dates",null,"Dates",null,"Dates","Dates",null,"Dates",null,"Dates","Dates","Dates","Dates"]
[null,1,{"$nulls":16},1]
[]
[null,16,{"$nulls":16},16]
[]
[null,8,{"$nulls":16},8]
[]
[null,9,{"$nulls":16},9]
[]
[null,5,{"$nulls":16},5]
[]
[null,12,{"$nulls":16},12]
[{"$nulls":9},"FINAL                                                                                                                                                                                                                   "]
[null,4,{"$nulls":16},4]
[]
[null,13,{"$nulls":16},13]
[]
[null,6,{"$nulls":16},6]
[]
[null,11,{"$nulls":16},11]
[]
[null,3,{"$nulls":16},3]
[]
[null,14,{"$nulls":16},14]
[]
[null,7,{"$nulls":16},7]
[]
[null,10,{"$nulls":16},10]
{"$rows_left_out":37}
{"sheet":"Tracker","index":1,"n_rows":80,"n_cols":14,"rows_kept":80,"merged":[[0,4,0,5],[0,6,0,7],[0,8,0,9],[0,10,0,11],[0,12,0,13],[2,1,33,1],[34,1,34,3],[35,1,35,13],[36,4,36,5],[36,6,36,7],[36,8,36,9],[36,10,36,11],[36,12,36,13],[38,1,53,1],[54,1,54,3],[55,1,55,13],[56,1,63,1],[64,1,64,3],[65,1,65,13],[66,1,69,1],[70,1,70,3],[71,1,71,13],[72,1,73,1],[74,1,74,3],[75,1,75,13],[77,1,77,3],[78,1,78,13],[79,1,79,3]]}
[{"$nulls":4},"Player 1",null,"Player 2",null,"Player 3",null,"Player 4",null,"Player 5"]
[null,"Rounds","Match-ups","Winner","Pick","Results","Pick","Results","Pick","Results","Pick","Results","Pick","Results"]
[null,"2nd",{"$f":"CONCATENATE(Bracket!C4, \" vs. \", Bracket!C6)","v":" vs. "},{"$f":"IF(Bracket!D5 <> \"\", Bracket!D5, \"— Undecided —\")","v":"— Undecided —"},"[Pick a team]",{"$f":"IF(Bracket!D5=E3,1,0)","v":0},"[Pick a team]",{"$f":"IF(Bracket!D5=G3, 1, 0)","v":0},"[Pick a team]",{"$f":"IF(Bracket!D5=I3, 1, 0)","v":0},"[Pick a team]",{"$f":"IF(Bracket!D5=K3, 1, 0)","v":0},"[Pick a team]",{"$f":"IF(Bracket!D5=M3, 1, 0)","v":0}]
[null,null,{"$f":"CONCATENATE(Bracket!C8, \" vs. \", Bracket!C10)","v":" vs. "},{"$f":"IF(Bracket!D9 <> \"\", Bracket!D9, \"— Undecided —\")","v":"— Undecided —"},"[Pick a team]",{"$f":"IF(Bracket!D9=E4,1,0)","v":0},"[Pick a team]",{"$f":"IF(Bracket!D9=G4,1,0)","v":0},"[Pick a team]",{"$f":"IF(Bracket!D9=I4,1,0)","v":0},"[Pick a team]",{"$f":"IF(Bracket!D9=K4,1,0)","v":0},"[Pick a team]",{"$f":"IF(Bracket!D9=M4,1,0)","v":0}]
[null,null,{"$f":"CONCATENATE(Bracket!C12, \" vs. \", Bracket!C14)","v":" vs. "},{"$f":"IF(Bracket!D13 <> \"\", Bracket!D13, \"— Undecided —\")","v":"— Undecided —"},"[Pick a team]",{"$f":"IF(Bracket!D13=E5,1,0)","v":0},"[Pick a team]",{"$f":"IF(Bracket!D13=G5,1,0)","v":0},"[Pick a team]",{"$f":"IF(Bracket!D13=I5,1,0)","v":0},"[Pick a team]",{"$f":"IF(Bracket!D13=K5,1,0)","v":0},"[Pick a team]",{"$f":"IF(Bracket!D13=M5,1,0)","v":0}]
[null,null,{"$f":"CONCATENATE(Bracket!C16, \" vs. \", Bracket!C18)","v":" vs. "},{"$f":"IF(Bracket!D17 <> \"\", Bracket!D17, \"— Undecided —\")","v":"— Undecided —"},"[Pick a team]",{"$f":"IF(Bracket!D17=E6,1,0)","v":0},"[Pick a team]",{"$f":"IF(Bracket!D17=G6,1,0)","v":0},"[Pick a team]",{"$f":"IF(Bracket!D17=I6,1,0)","v":0},"[Pick a team]",{"$f":"IF(Bracket!D17=K6,1,0)","v":0},"[Pick a team]",{"$f":"IF(Bracket!D17=M6,1,0)","v":0}]
[null,null,{"$f":"CONCATENATE(Bracket!C20, \" vs. \", Bracket!C22)","v":" vs. "},{"$f":"IF(Bracket!D21 <> \"\", Bracket!D21, \"— Undecided —\")","v":"— Undecided —"},"[Pick a team]",{"$f":"IF(Bracket!D21=E7,1,0)","v":0},"[Pick a team]",{"$f":"IF(Bracket!D21=G7,1,0)","v":0},"[Pick a team]",{"$f":"IF(Bracket!D21=I7,1,0)","v":0},"[Pick a team]",{"$f":"IF(Bracket!D21=K7,1,0)","v":0},"[Pick a team]",{"$f":"IF(Bracket!D21=M7,1,0)","v":0}]
[null,null,{"$f":"CONCATENATE(Bracket!C24, \" vs. \", Bracket!C26)","v":" vs. "},{"$f":"IF(Bracket!D25 <> \"\", Bracket!D25, \"— Undecided —\")","v":"— Undecided —"},"[Pick a team]",{"$f":"IF(Bracket!D25=E8,1,0)","v":0},"[Pick a team]",{"$f":"IF(Bracket!D25=G8,1,0)","v":0},"[Pick a team]",{"$f":"IF(Bracket!D25=I8,1,0)","v":0},"[Pick a team]",{"$f":"IF(Bracket!D25=K8,1,0)","v":0},"[Pick a team]",{"$f":"IF(Bracket!D25=M8,1,0)","v":0}]
[null,null,{"$f":"CONCATENATE(Bracket!C28, \" vs. \", Bracket!C30)","v":" vs. "},{"$f":"IF(Bracket!D29 <> \"\", Bracket!D29, \"— Undecided —\")","v":"— Undecided —"},"[Pick a team]",{"$f":"IF(Bracket!D29=E9,1,0)","v":0},"[Pick a team]",{"$f":"IF(Bracket!D29=G9,1,0)","v":0},"[Pick a team]",{"$f":"IF(Bracket!D29=I9,1,0)","v":0},"[Pick a team]",{"$f":"IF(Bracket!D29=K9,1,0)","v":0},"[Pick a team]",{"$f":"IF(Bracket!D29=M9,1,0)","v":0}]
[null,null,{"$f":"CONCATENATE(Bracket!C32, \" vs. \", Bracket!C34)","v":" vs. "},{"$f":"IF(Bracket!D33 <> \"\", Bracket!D33, \"— Undecided —\")","v":"— Undecided —"},"[Pick a team]",{"$f":"IF(Bracket!D33=E10,1,0)","v":0},"[Pick a team]",{"$f":"IF(Bracket!D33=G10,1,0)","v":0},"[Pick a team]",{"$f":"IF(Bracket!D33=I10,1,0)","v":0},"[Pick a team]",{"$f":"IF(Bracket!D33=K10,1,0)","v":0},"[Pick a team]",{"$f":"IF(Bracket!D33=M10,1,0)","v":0}]
[null,null,{"$f":"CONCATENATE(Bracket!C36, \" vs. \", Bracket!C38)","v":" vs. "},{"$f":"IF(Bracket!D37 <> \"\", Bracket!D37, \"— Undecided —\")","v":"— Undecided —"},"[Pick a team]",{"$f":"IF(Bracket!D37=E11,1,0)","v":0},"[Pick a team]",{"$f":"IF(Bracket!D37=G11,1,0)","v":0},"[Pick a team]",{"$f":"IF(Bracket!D37=I11,1,0)","v":0},"[Pick a team]",{"$f":"IF(Bracket!D37=K11,1,0)","v":0},"[Pick a team]",{"$f":"IF(Bracket!D37=M11,1,0)","v":0}]
[null,null,{"$f":"CONCATENATE(Bracket!C40, \" vs. \", Bracket!C42)","v":" vs. "},{"$f":"IF(Bracket!D41 <> \"\", Bracket!D41, \"— Undecided —\")","v":"— Undecided —"},"[Pick a team]",{"$f":"IF(Bracket!D41=E12,1,0)","v":0},"[Pick a team]",{"$f":"IF(Bracket!D41=G12,1,0)","v":0},"[Pick a team]",{"$f":"IF(Bracket!D41=I12,1,0)","v":0},"[Pick a team]",{"$f":"IF(Bracket!D41=K12,1,0)","v":0},"[Pick a team]",{"$f":"IF(Bracket!D41=M12,1,0)","v":0}]
[null,null,{"$f":"CONCATENATE(Bracket!C44, \" vs. \", Bracket!C46)","v":" vs. "},{"$f":"IF(Bracket!D45 <> \"\", Bracket!D45, \"— Undecided —\")","v":"— Undecided —"},"[Pick a team]",{"$f":"IF(Bracket!D45=E13,1,0)","v":0},"[Pick a team]",{"$f":"IF(Bracket!D45=G13,1,0)","v":0},"[Pick a team]",{"$f":"IF(Bracket!D45=I13,1,0)","v":0},"[Pick a team]",{"$f":"IF(Bracket!D45=K13,1,0)","v":0},"[Pick a team]",{"$f":"IF(Bracket!D45=M13,1,0)","v":0}]
[null,null,{"$f":"CONCATENATE(Bracket!C48, \" vs. \", Bracket!C50)","v":" vs. "},{"$f":"IF(Bracket!D49 <> \"\", Bracket!D49, \"— Undecided —\")","v":"— Undecided —"},"[Pick a team]",{"$f":"IF(Bracket!D49=E14,1,0)","v":0},"[Pick a team]",{"$f":"IF(Bracket!D49=G14,1,0)","v":0},"[Pick a team]",{"$f":"IF(Bracket!D49=I14,1,0)","v":0},"[Pick a team]",{"$f":"IF(Bracket!D49=K14,1,0)","v":0},"[Pick a team]",{"$f":"IF(Bracket!D49=M14,1,0)","v":0}]
[null,null,{"$f":"CONCATENATE(Bracket!C52, \" vs. \", Bracket!C54)","v":" vs. "},{"$f":"IF(Bracket!D53 <> \"\", Bracket!D53, \"— Undecided —\")","v":"— Undecided —"},"[Pick a team]",{"$f":"IF(Bracket!D53=E15,1,0)","v":0},"[Pick a team]",{"$f":"IF(Bracket!D53=G15,1,0)","v":0},"[Pick a team]",{"$f":"IF(Bracket!D53=I15,1,0)","v":0},"[Pick a team]",{"$f":"IF(Bracket!D53=K15,1,0)","v":0},"[Pick a team]",{"$f":"IF(Bracket!D53=M15,1,0)","v":0}]
[null,null,{"$f":"CONCATENATE(Bracket!C56, \" vs. \", Bracket!C58)","v":" vs. "},{"$f":"IF(Bracket!D57 <> \"\", Bracket!D57, \"— Undecided —\")","v":"— Undecided —"},"[Pick a team]",{"$f":"IF(Bracket!D57=E16,1,0)","v":0},"[Pick a team]",{"$f":"IF(Bracket!D57=G16,1,0)","v":0},"[Pick a team]",{"$f":"IF(Bracket!D57=I16,1,0)","v":0},"[Pick a team]",{"$f":"IF(Bracket!D57=K16,1,0)","v":0},"[Pick a team]",{"$f":"IF(Bracket!D57=M16,1,0)","v":0}]
[null,null,{"$f":"CONCATENATE(Bracket!C60, \" vs. \", Bracket!C62)","v":" vs. "},{"$f":"IF(Bracket!D61 <> \"\", Bracket!D61, \"— Undecided —\")","v":"— Undecided —"},"[Pick a team]",{"$f":"IF(Bracket!D61=E17,1,0)","v":0},"[Pick a team]",{"$f":"IF(Bracket!D61=G17,1,0)","v":0},"[Pick a team]",{"$f":"IF(Bracket!D61=I17,1,0)","v":0},"[Pick a team]",{"$f":"IF(Bracket!D61=K17,1,0)","v":0},"[Pick a team]",{"$f":"IF(Bracket!D61=M17,1,0)","v":0}]
[null,null,{"$f":"CONCATENATE(Bracket!C64, \" vs. \", Bracket!C66)","v":" vs. "},{"$f":"IF(Bracket!D65 <> \"\", Bracket!D65, \"— Undecided —\")","v":"— Undecided —"},"[Pick a team]",{"$f":"IF(Bracket!D65=E18,1,0)","v":0},"[Pick a team]",{"$f":"IF(Bracket!D65=G18,1,0)","v":0},"[Pick a team]",{"$f":"IF(Bracket!D65=I18,1,0)","v":0},"[Pick a team]",{"$f":"IF(Bracket!D65=K18,1,0)","v":0},"[Pick a team]",{"$f":"IF(Bracket!D65=M18,1,0)","v":0}]
[null,null,{"$f":"CONCATENATE(Bracket!R4, \" vs. \", Bracket!R6)","v":" vs. "},{"$f":"IF(Bracket!Q5 <> \"\", Bracket!Q5,\"— Undecided —\")","v":"— Undecided —"},"[Pick a team]",{"$f":"IF(Bracket!Q5=E19,1,0)","v":0},"[Pick a team]",{"$f":"IF(Bracket!Q5=G19,1,0)","v":0},"[Pick a team]",{"$f":"IF(Bracket!Q5=I19, 1, 0)","v":0},"[Pick a team]",{"$f":"IF(Bracket!Q5=K19, 1, 0)","v":0},"[Pick a team]",{"$f":"IF(Bracket!Q5=M19, 1, 0)","v":0}]
[null,null,{"$f":"CONCATENATE(Bracket!R8, \" vs. \", Bracket!R10)","v":" vs. "},{"$f":"IF(Bracket!Q9 <> \"\", Bracket!Q9, \"— Undecided —\")","v":"— Undecided —"},"[Pick a team]",{"$f":"IF(Bracket!Q9=E20,1,0)","v":0},"[Pick a team]",{"$f":"IF(Bracket!Q9=G20,1,0)","v":0},"[Pick a team]",{"$f":"IF(Bracket!Q9=I20,1,0)","v":0},"[Pick a team]",{"$f":"IF(Bracket!Q9=K20,1,0)","v":0},"[Pick a team]",{"$f":"IF(Bracket!Q9=M20,1,0)","v":0}]
[null,null,{"$f":"CONCATENATE(Bracket!R12, \" vs. \", Bracket!R14)","v":" vs. "},{"$f":"IF(Bracket!Q13 <> \"\", Bracket!Q13, \"— Undecided —\")","v":"— Undecided —"},"[Pick a team]",{"$f":"IF(Bracket!Q13=E21,1,0)","v":0},"[Pick a team]",{"$f":"IF(Bracket!Q13=G21,1,0)","v":0},"[Pick a team]",{"$f":"IF(Bracket!Q13=I21,1,0)","v":0},"[Pick a team]",{"$f":"IF(Bracket!Q13=K21,1,0)","v":0},"[Pick a team]",{"$f":"IF(Bracket!Q13=M21,1,0)","v":0}]
[null,null,{"$f":"CONCATENATE(Bracket!R16, \" vs. \", Bracket!R18)","v":" vs. "},{"$f":"IF(Bracket!Q17 <> \"\", Bracket!Q17, \"— Undecided —\")","v":"— Undecided —"},"[Pick a team]",{"$f":"IF(Bracket!Q17=E22,1,0)","v":0},"[Pick a team]",{"$f":"IF(Bracket!Q17=G22,1,0)","v":0},"[Pick a team]",{"$f":"IF(Bracket!Q17=I22,1,0)","v":0},"[Pick a team]",{"$f":"IF(Bracket!Q17=K22,1,0)","v":0},"[Pick a team]",{"$f":"IF(Bracket!Q17=M22,1,0)","v":0}]
[null,null,{"$f":"CONCATENATE(Bracket!R20, \" vs. \", Bracket!R22)","v":" vs. "},{"$f":"IF(Bracket!Q21 <> \"\", Bracket!Q21, \"— Undecided —\")","v":"— Undecided —"},"[Pick a team]",{"$f":"IF(Bracket!Q21=E23,1,0)","v":0},"[Pick a team]",{"$f":"IF(Bracket!Q21=G23,1,0)","v":0},"[Pick a team]",{"$f":"IF(Bracket!Q21=I23,1,0)","v":0},"[Pick a team]",{"$f":"IF(Bracket!Q21=K23,1,0)","v":0},"[Pick a team]",{"$f":"IF(Bracket!Q21=M23,1,0)","v":0}]
[null,null,{"$f":"CONCATENATE(Bracket!R24, \" vs. \", Bracket!R26)","v":" vs. "},{"$f":"IF(Bracket!Q25 <> \"\", Bracket!Q25, \"— Undecided —\")","v":"— Undecided —"},"[Pick a team]",{"$f":"IF(Bracket!Q25=E24,1,0)","v":0},"[Pick a team]",{"$f":"IF(Bracket!Q25=G24,1,0)","v":0},"[Pick a team]",{"$f":"IF(Bracket!Q25=I24,1,0)","v":0},"[Pick a team]",{"$f":"IF(Bracket!Q25=K24,1,0)","v":0},"[Pick a team]",{"$f":"IF(Bracket!Q25=M24,1,0)","v":0}]
[null,null,{"$f":"CONCATENATE(Bracket!R28, \" vs. \", Bracket!R30)","v":" vs. "},{"$f":"IF(Bracket!Q29 <> \"\", Bracket!Q29, \"— Undecided —\")","v":"— Undecided —"},"[Pick a team]",{"$f":"IF(Bracket!Q29=E25,1,0)","v":0},"[Pick a team]",{"$f":"IF(Bracket!Q29=G25,1,0)","v":0},"[Pick a team]",{"$f":"IF(Bracket!Q29=I25,1,0)","v":0},"[Pick a team]",{"$f":"IF(Bracket!Q29=K25,1,0)","v":0},"[Pick a team]",{"$f":"IF(Bracket!Q29=M25,1,0)","v":0}]
[null,null,{"$f":"CONCATENATE(Bracket!R32, \" vs. \", Bracket!R34)","v":" vs. "},{"$f":"IF(Bracket!Q33 <> \"\", Bracket!Q33, \"— Undecided —\")","v":"— Undecided —"},"[Pick a team]",{"$f":"IF(Bracket!Q33=E26,1,0)","v":0},"[Pick a team]",{"$f":"IF(Bracket!Q33=G26,1,0)","v":0},"[Pick a team]",{"$f":"IF(Bracket!Q33=I26,1,0)","v":0},"[Pick a team]",{"$f":"IF(Bracket!Q33=K26,1,0)","v":0},"[Pick a team]",{"$f":"IF(Bracket!Q33=M26,1,0)","v":0}]
[null,null,{"$f":"CONCATENATE(Bracket!R36, \" vs. \", Bracket!R38)","v":" vs. "},{"$f":"IF(Bracket!Q37 <> \"\", Bracket!Q37, \"— Undecided —\")","v":"— Undecided —"},"[Pick a team]",{"$f":"IF(Bracket!Q37=E27,1,0)","v":0},"[Pick a team]",{"$f":"IF(Bracket!Q37=G27,1,0)","v":0},"[Pick a team]",{"$f":"IF(Bracket!Q37=I27,1,0)","v":0},"[Pick a team]",{"$f":"IF(Bracket!Q37=K27,1,0)","v":0},"[Pick a team]",{"$f":"IF(Bracket!Q37=M27,1,0)","v":0}]
[null,null,{"$f":"CONCATENATE(Bracket!R40, \" vs. \", Bracket!R42)","v":" vs. "},{"$f":"IF(Bracket!Q41 <> \"\", Bracket!Q41, \"— Undecided —\")","v":"— Undecided —"},"[Pick a team]",{"$f":"IF(Bracket!Q41=E28,1,0)","v":0},"[Pick a team]",{"$f":"IF(Bracket!Q41=G28,1,0)","v":0},"[Pick a team]",{"$f":"IF(Bracket!Q41=I28,1,0)","v":0},"[Pick a team]",{"$f":"IF(Bracket!Q41=K28,1,0)","v":0},"[Pick a team]",{"$f":"IF(Bracket!Q41=M28,1,0)","v":0}]
[null,null,{"$f":"CONCATENATE(Bracket!R44, \" vs. \", Bracket!R46)","v":" vs. "},{"$f":"IF(Bracket!Q45 <> \"\", Bracket!Q45, \"— Undecided —\")","v":"— Undecided —"},"[Pick a team]",{"$f":"IF(Bracket!Q45=E29,1,0)","v":0},"[Pick a team]",{"$f":"IF(Bracket!Q45=G29,1,0)","v":0},"[Pick a team]",{"$f":"IF(Bracket!Q45=I29,1,0)","v":0},"[Pick a team]",{"$f":"IF(Bracket!Q45=K29,1,0)","v":0},"[Pick a team]",{"$f":"IF(Bracket!Q45=M29,1,0)","v":0}]
[null,null,{"$f":"CONCATENATE(Bracket!R48, \" vs. \", Bracket!R50)","v":" vs. "},{"$f":"IF(Bracket!Q49 <> \"\", Bracket!Q49, \"— Undecided —\")","v":"— Undecided —"},"[Pick a team]",{"$f":"IF(Bracket!Q49=E30,1,0)","v":0},"[Pick a team]",{"$f":"IF(Bracket!Q49=G30,1,0)","v":0},"[Pick a team]",{"$f":"IF(Bracket!Q49=I30,1,0)","v":0},"[Pick a team]",{"$f":"IF(Bracket!Q49=K30,1,0)","v":0},"[Pick a team]",{"$f":"IF(Bracket!Q49=M30,1,0)","v":0}]
{"$rows_left_out":51}
{"sheet":"Validation","index":2,"n_rows":3,"n_cols":63,"rows_kept":3,"hidden":true}
["[Pick a team]","[Pick a team]","[Pick a team]","[Pick a team]","[Pick a team]","[Pick a team]","[Pick a team]","[Pick a team]","[Pick a team]","[Pick a team]","[Pick a team]","[Pick a team]","[Pick a team]","[Pick a team]","[Pick a team]","[Pick a team]","[Pick a team]","[Pick a team]","[Pick a team]","[Pick a team]","[Pick a team]","[Pick a team]","[Pick a team]","[Pick a team]","[Pick a team]","[Pick a team]","[Pick a team]","[Pick a team]","[Pick a team]","[Pick a team]","[Pick a team]","[Pick a team]","[Pick a team]","[Pick a team]","[Pick a team]","[Pick a team]","[Pick a team]","[Pick a team]","[Pick a team]","[Pick a team]","[Pick a team]","[Pick a team]","[Pick a team]","[Pick a team]","[Pick a team]","[Pick a team]","[Pick a team]","[Pick a team]","[Pick a team]","[Pick a team]","[Pick a team]","[Pick a team]","[Pick a team]","[Pick a team]","[Pick a team]","[Pick a team]","[Pick a team]","[Pick a team]","[Pick a team]","[Pick a team]","[Pick a team]","[Pick a team]","[Pick a team]"]
[{"$f":"Bracket!C4","v":0},{"$f":"Bracket!C8","v":0},{"$f":"Bracket!C12","v":0},{"$f":"Bracket!C16","v":0},{"$f":"Bracket!C20","v":0},{"$f":"Bracket!C24","v":0},{"$f":"Bracket!C28","v":0},{"$f":"Bracket!C32","v":0},{"$f":"Bracket!C36","v":0},{"$f":"Bracket!C40","v":0},{"$f":"Bracket!C44","v":0},{"$f":"Bracket!C48","v":0},{"$f":"Bracket!C52","v":0},{"$f":"Bracket!C56","v":0},{"$f":"Bracket!C60","v":0},{"$f":"Bracket!C64","v":0},{"$f":"Bracket!R4","v":0},{"$f":"Bracket!R8","v":0},{"$f":"Bracket!R12","v":0},{"$f":"Bracket!R16","v":0},{"$f":"Bracket!R20","v":0},{"$f":"Bracket!R24","v":0},{"$f":"Bracket!R28","v":0},{"$f":"Bracket!R32","v":0},{"$f":"Bracket!R36","v":0},{"$f":"Bracket!R40","v":0},{"$f":"Bracket!R44","v":0},{"$f":"Bracket!R48","v":0},{"$f":"Bracket!R52","v":0},{"$f":"Bracket!R56","v":0},{"$f":"Bracket!R60","v":0},{"$f":"Bracket!R64","v":0},{"$f":"IF(Bracket!D5 <> \"\", Bracket!D5, \"— Undecided —\")","v":"— Undecided —"},{"$f":"IF(Bracket!D13 <> \"\", Bracket!D13, \"— Undecided —\")","v":"— Undecided —"},{"$f":"IF(Bracket!D21 <> \"\", Bracket!D21, \"— Undecided —\")","v":"— Undecided —"},{"$f":"IF(Bracket!D29 <> \"\", Bracket!D29, \"— Undecided —\")","v":"— Undecided —"},{"$f":"IF(Bracket!D37 <> \"\", Bracket!D37, \"— Undecided —\")","v":"— Undecided —"},{"$f":"IF(Bracket!D45 <> \"\", Bracket!D45, \"— Undecided —\")","v":"— Undecided —"},{"$f":"IF(Bracket!D53 <> \"\", Bracket!D53, \"— Undecided —\")","v":"— Undecided —"},{"$f":"IF(Bracket!D61 <> \"\", Bracket!D61, \"— Undecided —\")","v":"— Undecided —"},{"$f":"IF(Bracket!Q5 <> \"\", Bracket!Q5,\"— Undecided —\")","v":"— Undecided —"},{"$f":"IF(Bracket!Q13 <> \"\", Bracket!Q13, \"— Undecided —\")","v":"— Undecided —"},{"$f":"IF(Bracket!Q21 <> \"\", Bracket!Q21, \"— Undecided —\")","v":"— Undecided —"},{"$f":"IF(Bracket!Q29 <> \"\", Bracket!Q29, \"— Undecided —\")","v":"— Undecided —"},{"$f":"IF(Bracket!Q37 <> \"\", Bracket!Q37, \"— Undecided —\")","v":"— Undecided —"},{"$f":"IF(Bracket!Q45 <> \"\", Bracket!Q45, \"— Undecided —\")","v":"— Undecided —"},{"$f":"IF(Bracket!Q53 <> \"\", Bracket!Q53, \"— Undecided —\")","v":"— Undecided —"},{"$f":"IF(Bracket!Q61 <> \"\", Bracket!Q61, \"— Undecided —\")","v":"— Undecided —"},{"$f":"IF(Bracket!E7 <> \"\", Bracket!E7, \"— Undecided —\")","v":"— Undecided —"},{"$f":"IF(Bracket!E23 <> \"\", Bracket!E23, \"— Undecided —\")","v":"— Undecided —"},{"$f":"IF(Bracket!E39 <> \"\", Bracket!E39, \"— Undecided —\")","v":"— Undecided —"},{"$f":"IF(Bracket!E55 <> \"\", Bracket!E55, \"— Undecided —\")","v":"— Undecided —"},{"$f":"IF(Bracket!P7 <> \"\", Bracket!P7, \"— Undecided —\")","v":"— Undecided —"},{"$f":"IF(Bracket!P23<> \"\", Bracket!P23, \"— Undecided —\")","v":"— Undecided —"},{"$f":"IF(Bracket!P39 <> \"\", Bracket!P39, \"— Undecided —\")","v":"— Undecided —"},{"$f":"IF(Bracket!P55 <> \"\", Bracket!P55, \"— Undecided —\")","v":"— Undecided —"},{"$f":"IF(Bracket!F11 <> \"\", Bracket!F11, \"— Undecided —\")","v":"— Undecided —"},{"$f":"IF(Bracket!F43 <> \"\", Bracket!F43, \"— Undecided —\")","v":"— Undecided —"},{"$f":"IF(Bracket!O11 <> \"\", Bracket!O11, \"— Undecided —\")","v":"— Undecided —"},{"$f":"IF(Bracket!O43 <> \"\", Bracket!O43, \"— Undecided —\")","v":"— Undecided —"},{"$f":"IF(Bracket!G19 <> \"\", Bracket!G19, \"— Undecided —\")","v":"— Undecided —"},{"$f":"IF(Bracket!M19 <> \"\", Bracket!M19, \"— Undecided —\")","v":"— Undecided —"},{"$f":"IF(Bracket!I26 <> \"\", Bracket!I26, \"— Undecided —\")","v":"— Undecided —"}]
[{"$f":"Bracket!C6","v":0},{"$f":"Bracket!C10","v":0},{"$f":"Bracket!C14","v":0},{"$f":"Bracket!C18","v":0},{"$f":"Bracket!C22","v":0},{"$f":"Bracket!C26","v":0},{"$f":"Bracket!C30","v":0},{"$f":"Bracket!C34","v":0},{"$f":"Bracket!C38","v":0},{"$f":"Bracket!C42","v":0},{"$f":"Bracket!C46","v":0},{"$f":"Bracket!C50","v":0},{"$f":"Bracket!C54","v":0},{"$f":"Bracket!C58","v":0},{"$f":"Bracket!C62","v":0},{"$f":"Bracket!C66","v":0},{"$f":"Bracket!R6","v":0},{"$f":"Bracket!R10","v":0},{"$f":"Bracket!R14","v":0},{"$f":"Bracket!R18","v":0},{"$f":"Bracket!R22","v":0},{"$f":"Bracket!R26","v":0},{"$f":"Bracket!R30","v":0},{"$f":"Bracket!R34","v":0},{"$f":"Bracket!R38","v":0},{"$f":"Bracket!R42","v":0},{"$f":"Bracket!R46","v":0},{"$f":"Bracket!R50","v":0},{"$f":"Bracket!R54","v":0},{"$f":"Bracket!R58","v":0},{"$f":"Bracket!R62","v":0},{"$f":"Bracket!R66","v":0},{"$f":"IF(Bracket!D9 <> \"\", Bracket!D9, \"— Undecided —\")","v":"— Undecided —"},{"$f":"IF(Bracket!D17 <> \"\", Bracket!D17, \"— Undecided —\")","v":"— Undecided —"},{"$f":"IF(Bracket!D25 <> \"\", Bracket!D25, \"— Undecided —\")","v":"— Undecided —"},{"$f":"IF(Bracket!D33 <> \"\", Bracket!D33, \"— Undecided —\")","v":"— Undecided —"},{"$f":"IF(Bracket!D41 <> \"\", Bracket!D41, \"— Undecided —\")","v":"— Undecided —"},{"$f":"IF(Bracket!D49 <> \"\", Bracket!D49, \"— Undecided —\")","v":"— Undecided —"},{"$f":"IF(Bracket!D57 <> \"\", Bracket!D57, \"— Undecided —\")","v":"— Undecided —"},{"$f":"IF(Bracket!D65 <> \"\", Bracket!D65, \"— Undecided —\")","v":"— Undecided —"},{"$f":"IF(Bracket!Q9 <> \"\", Bracket!Q9, \"— Undecided —\")","v":"— Undecided —"},{"$f":"IF(Bracket!Q17 <> \"\", Bracket!Q17, \"— Undecided —\")","v":"— Undecided —"},{"$f":"IF(Bracket!Q25 <> \"\", Bracket!Q25, \"— Undecided —\")","v":"— Undecided —"},{"$f":"IF(Bracket!Q33 <> \"\", Bracket!Q33, \"— Undecided —\")","v":"— Undecided —"},{"$f":"IF(Bracket!Q41 <> \"\", Bracket!Q41, \"— Undecided —\")","v":"— Undecided —"},{"$f":"IF(Bracket!Q49 <> \"\", Bracket!Q49, \"— Undecided —\")","v":"— Undecided —"},{"$f":"IF(Bracket!Q57 <> \"\", Bracket!Q57, \"— Undecided —\")","v":"— Undecided —"},{"$f":"IF(Bracket!Q65 <> \"\", Bracket!Q65, \"— Undecided —\")","v":"— Undecided —"},{"$f":"IF(Bracket!E15 <> \"\", Bracket!E15, \"— Undecided —\")","v":"— Undecided —"},{"$f":"IF(Bracket!E31 <> \"\", Bracket!E31, \"— Undecided —\")","v":"— Undecided —"},{"$f":"IF(Bracket!E47 <> \"\", Bracket!E47, \"— Undecided —\")","v":"— Undecided —"},{"$f":"IF(Bracket!E63 <> \"\", Bracket!E63, \"— Undecided —\")","v":"— Undecided —"},{"$f":"IF(Bracket!P15<> \"\", Bracket!P15, \"— Undecided —\")","v":"— Undecided —"},{"$f":"IF(Bracket!P31<> \"\", Bracket!P31, \"— Undecided —\")","v":"— Undecided —"},{"$f":"IF(Bracket!P47<> \"\", Bracket!P47, \"— Undecided —\")","v":"— Undecided —"},{"$f":"IF(Bracket!P63<> \"\", Bracket!P63, \"— Undecided —\")","v":"— Undecided —"},{"$f":"IF(Bracket!F27 <> \"\", Bracket!F27, \"— Undecided —\")","v":"— Undecided —"},{"$f":"IF(Bracket!F59 <> \"\", Bracket!F59, \"— Undecided —\")","v":"— Undecided —"},{"$f":"IF(Bracket!O27 <> \"\", Bracket!O27, \"— Undecided —\")","v":"— Undecided —"},{"$f":"IF(Bracket!O59 <> \"\", Bracket!O59, \"— Undecided —\")","v":"— Undecided —"},{"$f":"IF(Bracket!G51<> \"\", Bracket!G51, \"— Undecided —\")","v":"— Undecided —"},{"$f":"IF(Bracket!M51<> \"\", Bracket!M51, \"— Undecided —\")","v":"— Undecided —"},{"$f":"IF(Bracket!K44<> \"\", Bracket!K44, \"— Undecided —\")","v":"— Undecided —"}]