{"text_format":"3","workbook":"xlsx","n_sheets":3,"sheets":["PROJECT PARAMETERS","PROJECT DETAILS","PROJECT TOTALS"],"not_rendered":{"charts":2,"defined_names":3,"pivot_tables":1},"read":"whole","date_system":"1900"}

{"sheet":"PROJECT PARAMETERS","index":0,"n_rows":20,"n_cols":9,"rows_kept":20,"merged":[[1,6,1,8],[3,6,3,8]]}
[]
[null,"ROBOTINE MANUFACTURING",{"$nulls":4},{"$f":"B2 & \":\" & CHAR(10) & \"CONFIDENTIAL\"","v":"ROBOTINE MANUFACTURING:\nCONFIDENTIAL"}]
[null," Event management project tracker"]
[{"$nulls":6},"Shaded cells are calculated for you. You do not need to enter anything into them."]
[]
[null,"PROJECT TYPE","ACCOUNT MANAGER","PROJECT MANAGER","STRATEGY MANAGER","DESIGN SPECIALIST","EVENT STAFF","ADMIN STAFF","TOTAL"]
[null,"Event strategy development",{"v":0.2,"d":"20%"},{"v":0.1,"d":"10%"},{"v":0.6,"d":"60%"},{"v":0,"d":"0%"},{"v":0,"d":"0%"},{"v":0.1,"d":"10%"},{"$f":"SUM(Parameters[[#This Row],[ACCOUNT MANAGER]:[ADMIN STAFF]])","v":{"v":1,"d":"100%"}}]
[null,"Event planning",{"v":0.2,"d":"20%"},{"v":0.5,"d":"50%"},{"v":0.1,"d":"10%"},{"v":0.1,"d":"10%"},{"v":0,"d":"0%"},{"v":0.1,"d":"10%"},{"$f":"SUM(Parameters[[#This Row],[ACCOUNT MANAGER]:[ADMIN STAFF]])","v":{"v":0.9999999999999999,"d":"100%"}}]
{"$rows_left_out":13}
{"sheet":"PROJECT DETAILS","index":1,"n_rows":11,"n_cols":26,"rows_kept":11,"merged":[[1,10,1,28],[4,25,10,27]]}
[]
[null,{"$f":"'PROJECT PARAMETERS'!B2","v":"ROBOTINE MANUFACTURING"},{"$nulls":8},{"$f":"'PROJECT PARAMETERS'!G2","v":"ROBOTINE MANUFACTURING:\nCONFIDENTIAL"}]
[null," Event management project tracker"]
[]
[null,"PROJECT NAME","PROJECT TYPE","ESTIMATED START","ESTIMATED FINISH","ACTUAL\nSTART","ACTUAL FINISH","ESTIMATED WORK","ACTUAL\nWORK","ESTIMATED DURATION","ACTUAL DURATION","ACCOUNT MANAGER","PROJECT MANAGER","STRATEGY MANAGER","DESIGN SPECIALIST","EVENT STAFF","ADMIN STAFF","ACCOUNT MANAGER ","PROJECT MANAGER ","STRATEGY MANAGER ","DESIGN SPECIALIST ","EVENT STAFF ","ADMIN STAFF ",null,null,"INFO\n\nTo add a row, select the bottom-right most cell in the body of the table (not the totals row) and press Tab, or right-click where you want the row inserted and select Insert | Table Rows Above/Below.\n\nBe sure all unused rows are deleted, as the PROJECT TOTALS PivotTable will use all of the tables cells, and otherwise would give erroneous results."]
[null,"Project 1","Event strategy development",{"$f":"DATE(YEAR(TODAY()),6,9)","v":"2023-06-09"},{"$f":" DATE(YEAR(TODAY()),8,7)","v":"2023-08-07"},{"$f":"DATE(YEAR(TODAY()),6,29)","v":"2023-06-29"},{"$f":"DATE(YEAR(TODAY()),9,3)","v":"2023-09-03"},200,220,{"$f":"DAYS360(ProjectDetails[[#This Row],[ESTIMATED START]],ProjectDetails[[#This Row],[ESTIMATED FINISH]],FALSE)","v":58},{"$f":"DAYS360(ProjectDetails[[#This Row],[ACTUAL\nSTART]],ProjectDetails[[#This Row],[ACTUAL FINISH]],FALSE)","v":64},{"$f":"INDEX(Parameters[],MATCH(ProjectDetails[[#This Row],[PROJECT TYPE]],Parameters[PROJECT TYPE],0),MATCH(ProjectDetails[[#Headers],[ACCOUNT MANAGER]],Parameters[#Headers],0))*INDEX('PROJECT PARAMETERS'!$B$13:$H$13,1,MATCH(ProjectDetails[[#Headers],[ACCOUNT MANAGER]],Parameters[#Headers],0))*ProjectDetails[[#This Row],[ESTIMATED WORK]]","v":"1919-09-17"},{"$f":"INDEX(Parameters[],MATCH(ProjectDetails[[#This Row],[PROJECT TYPE]],Parameters[PROJECT TYPE],0),MATCH(ProjectDetails[[#Headers],[PROJECT MANAGER]],Parameters[#Headers],0))*INDEX('PROJECT PARAMETERS'!$B$13:$H$13,1,MATCH(ProjectDetails[[#Headers],[PROJECT MANAGER]],Parameters[#Headers],0))*ProjectDetails[[#This Row],[ESTIMATED WORK]]","v":"1906-07-27"},{"$f":"INDEX(Parameters[],MATCH(ProjectDetails[[#This Row],[PROJECT TYPE]],Parameters[PROJECT TYPE],0),MATCH(ProjectDetails[[#Headers],[STRATEGY MANAGER]],Parameters[#Headers],0))*INDEX('PROJECT PARAMETERS'!$B$13:$H$13,1,MATCH(ProjectDetails[[#Headers],[STRATEGY MANAGER]],Parameters[#Headers],0))*ProjectDetails[[#This Row],[ESTIMATED WORK]]","v":"1949-04-12"},{"$f":"INDEX(Parameters[],MATCH(ProjectDetails[[#This Row],[PROJECT TYPE]],Parameters[PROJECT TYPE],0),MATCH(ProjectDetails[[#Headers],[DESIGN SPECIALIST]],Parameters[#Headers],0))*INDEX('PROJECT PARAMETERS'!$B$13:$H$13,1,MATCH(ProjectDetails[[#Headers],[DESIGN SPECIALIST]],Parameters[#Headers],0))*ProjectDetails[[#This Row],[ESTIMATED WORK]]","v":"00:00:00"},{"$f":"INDEX(Parameters[],MATCH(ProjectDetails[[#This Row],[PROJECT TYPE]],Parameters[PROJECT TYPE],0),MATCH(ProjectDetails[[#Headers],[EVENT STAFF]],Parameters[#Headers],0))*INDEX('PROJECT PARAMETERS'!$B$13:$H$13,1,MATCH(ProjectDetails[[#Headers],[EVENT STAFF]],Parameters[#Headers],0))*ProjectDetails[[#This Row],[ESTIMATED WORK]]","v":"00:00:00"},{"$f":"INDEX(Parameters[],MATCH(ProjectDetails[[#This Row],[PROJECT TYPE]],Parameters[PROJECT TYPE],0),MATCH(ProjectDetails[[#Headers],[ADMIN STAFF]],Parameters[#Headers],0))*INDEX('PROJECT PARAMETERS'!$B$13:$H$13,1,MATCH(ProjectDetails[[#Headers],[ADMIN STAFF]],Parameters[#Headers],0))*ProjectDetails[[#This Row],[ESTIMATED WORK]]","v":"1903-04-14"},{"$f":"INDEX(Parameters[],MATCH(ProjectDetails[[#This Row],[PROJECT TYPE]],Parameters[PROJECT TYPE],0),MATCH(ProjectDetails[[#Headers],[ACCOUNT MANAGER]],Parameters[#Headers],0))*INDEX('PROJECT PARAMETERS'!$B$13:$H$13,1,MATCH(ProjectDetails[[#Headers],[ACCOUNT MANAGER]],Parameters[#Headers],0))*ProjectDetails[[#This Row],[ACTUAL\nWORK]]","v":"1921-09-06"},{"$f":"INDEX(Parameters[],MATCH(ProjectDetails[[#This Row],[PROJECT TYPE]],Parameters[PROJECT TYPE],0),MATCH(ProjectDetails[[#Headers],[PROJECT MANAGER]],Parameters[#Headers],0))*INDEX('PROJECT PARAMETERS'!$B$13:$H$13,1,MATCH(ProjectDetails[[#Headers],[PROJECT MANAGER]],Parameters[#Headers],0))*ProjectDetails[[#This Row],[ACTUAL\nWORK]]","v":"1907-03-24"},{"$f":"INDEX(Parameters[],MATCH(ProjectDetails[[#This Row],[PROJECT TYPE]],Parameters[PROJECT TYPE],0),MATCH(ProjectDetails[[#Headers],[STRATEGY MANAGER]],Parameters[#Headers],0))*INDEX('PROJECT PARAMETERS'!$B$13:$H$13,1,MATCH(ProjectDetails[[#Headers],[STRATEGY MANAGER]],Parameters[#Headers],0))*ProjectDetails[[#This Row],[ACTUAL\nWORK]]","v":"1954-03-17"},{"$f":"INDEX(Parameters[],MATCH(ProjectDetails[[#This Row],[PROJECT TYPE]],Parameters[PROJECT TYPE],0),MATCH(ProjectDetails[[#Headers],[DESIGN SPECIALIST]],Parameters[#Headers],0))*INDEX('PROJECT PARAMETERS'!$B$13:$H$13,1,MATCH(ProjectDetails[[#Headers],[DESIGN SPECIALIST]],Parameters[#Headers],0))*ProjectDetails[[#This Row],[ACTUAL\nWORK]]","v":"00:00:00"},{"$f":"INDEX(Parameters[],MATCH(ProjectDetails[[#This Row],[PROJECT TYPE]],Parameters[PROJECT TYPE],0),MATCH(ProjectDetails[[#Headers],[EVENT STAFF]],Parameters[#Headers],0))*INDEX('PROJECT PARAMETERS'!$B$13:$H$13,1,MATCH(ProjectDetails[[#Headers],[EVENT STAFF]],Parameters[#Headers],0))*ProjectDetails[[#This Row],[ACTUAL\nWORK]]","v":"00:00:00"},{"$f":"INDEX(Parameters[],MATCH(ProjectDetails[[#This Row],[PROJECT TYPE]],Parameters[PROJECT TYPE],0),MATCH(ProjectDetails[[#Headers],[ADMIN STAFF]],Parameters[#Headers],0))*INDEX('PROJECT PARAMETERS'!$B$13:$H$13,1,MATCH(ProjectDetails[[#Headers],[ADMIN STAFF]],Parameters[#Headers],0))*ProjectDetails[[#This Row],[ACTUAL\nWORK]]","v":"1903-08-12"}]
[null,"Project 2","Event planning",{"$f":"DATE(YEAR(TODAY())+1,6,25)","v":"2024-06-25"},{"$f":"DATE(YEAR(TODAY())+1,7,27)","v":"2024-07-27"},{"$f":"DATE(YEAR(TODAY()),7,15)","v":"2023-07-15"},{"$f":"DATE(YEAR(TODAY())+1,8,25)","v":"2024-08-25"},400,390,{"$f":"DAYS360(ProjectDetails[[#This Row],[ESTIMATED START]],ProjectDetails[[#This Row],[ESTIMATED FINISH]],FALSE)","v":32},{"$f":"DAYS360(ProjectDetails[[#This Row],[ACTUAL\nSTART]],ProjectDetails[[#This Row],[ACTUAL FINISH]],FALSE)","v":400},{"$f":"INDEX(Parameters[],MATCH(ProjectDetails[[#This Row],[PROJECT TYPE]],Parameters[PROJECT TYPE],0),MATCH(ProjectDetails[[#Headers],[ACCOUNT MANAGER]],Parameters[#Headers],0))*INDEX('PROJECT PARAMETERS'!$B$13:$H$13,1,MATCH(ProjectDetails[[#Headers],[ACCOUNT MANAGER]],Parameters[#Headers],0))*ProjectDetails[[#This Row],[ESTIMATED WORK]]","v":"1939-06-04"},{"$f":"INDEX(Parameters[],MATCH(ProjectDetails[[#This Row],[PROJECT TYPE]],Parameters[PROJECT TYPE],0),MATCH(ProjectDetails[[#Headers],[PROJECT MANAGER]],Parameters[#Headers],0))*INDEX('PROJECT PARAMETERS'!$B$13:$H$13,1,MATCH(ProjectDetails[[#Headers],[PROJECT MANAGER]],Parameters[#Headers],0))*ProjectDetails[[#This Row],[ESTIMATED WORK]]","v":"1965-09-15"},{"$f":"INDEX(Parameters[],MATCH(ProjectDetails[[#This Row],[PROJECT TYPE]],Parameters[PROJECT TYPE],0),MATCH(ProjectDetails[[#Headers],[STRATEGY MANAGER]],Parameters[#Headers],0))*INDEX('PROJECT PARAMETERS'!$B$13:$H$13,1,MATCH(ProjectDetails[[#Headers],[STRATEGY MANAGER]],Parameters[#Headers],0))*ProjectDetails[[#This Row],[ESTIMATED WORK]]","v":"1916-06-04"},{"$f":"INDEX(Parameters[],MATCH(ProjectDetails[[#This Row],[PROJECT TYPE]],Parameters[PROJECT TYPE],0),MATCH(ProjectDetails[[#Headers],[DESIGN SPECIALIST]],Parameters[#Headers],0))*INDEX('PROJECT PARAMETERS'!$B$13:$H$13,1,MATCH(ProjectDetails[[#Headers],[DESIGN SPECIALIST]],Parameters[#Headers],0))*ProjectDetails[[#This Row],[ESTIMATED WORK]]","v":"1910-12-13"},{"$f":"INDEX(Parameters[],MATCH(ProjectDetails[[#This Row],[PROJECT TYPE]],Parameters[PROJECT TYPE],0),MATCH(ProjectDetails[[#Headers],[EVENT STAFF]],Parameters[#Headers],0))*INDEX('PROJECT PARAMETERS'!$B$13:$H$13,1,MATCH(ProjectDetails[[#Headers],[EVENT STAFF]],Parameters[#Headers],0))*ProjectDetails[[#This Row],[ESTIMATED WORK]]","v":"00:00:00"},{"$f":"INDEX(Parameters[],MATCH(ProjectDetails[[#This Row],[PROJECT TYPE]],Parameters[PROJECT TYPE],0),MATCH(ProjectDetails[[#Headers],[ADMIN STAFF]],Parameters[#Headers],0))*INDEX('PROJECT PARAMETERS'!$B$13:$H$13,1,MATCH(ProjectDetails[[#Headers],[ADMIN STAFF]],Parameters[#Headers],0))*ProjectDetails[[#This Row],[ESTIMATED WORK]]","v":"1906-07-27"},{"$f":"INDEX(Parameters[],MATCH(ProjectDetails[[#This Row],[PROJECT TYPE]],Parameters[PROJECT TYPE],0),MATCH(ProjectDetails[[#Headers],[ACCOUNT MANAGER]],Parameters[#Headers],0))*INDEX('PROJECT PARAMETERS'!$B$13:$H$13,1,MATCH(ProjectDetails[[#Headers],[ACCOUNT MANAGER]],Parameters[#Headers],0))*ProjectDetails[[#This Row],[ACTUAL\nWORK]]","v":"1938-06-09"},{"$f":"INDEX(Parameters[],MATCH(ProjectDetails[[#This Row],[PROJECT TYPE]],Parameters[PROJECT TYPE],0),MATCH(ProjectDetails[[#Headers],[PROJECT MANAGER]],Parameters[#Headers],0))*INDEX('PROJECT PARAMETERS'!$B$13:$H$13,1,MATCH(ProjectDetails[[#Headers],[PROJECT MANAGER]],Parameters[#Headers],0))*ProjectDetails[[#This Row],[ACTUAL\nWORK]]","v":"1964-01-24"},{"$f":"INDEX(Parameters[],MATCH(ProjectDetails[[#This Row],[PROJECT TYPE]],Parameters[PROJECT TYPE],0),MATCH(ProjectDetails[[#Headers],[STRATEGY MANAGER]],Parameters[#Headers],0))*INDEX('PROJECT PARAMETERS'!$B$13:$H$13,1,MATCH(ProjectDetails[[#Headers],[STRATEGY MANAGER]],Parameters[#Headers],0))*ProjectDetails[[#This Row],[ACTUAL\nWORK]]","v":"1916-01-06"},{"$f":"INDEX(Parameters[],MATCH(ProjectDetails[[#This Row],[PROJECT TYPE]],Parameters[PROJECT TYPE],0),MATCH(ProjectDetails[[#Headers],[DESIGN SPECIALIST]],Parameters[#Headers],0))*INDEX('PROJECT PARAMETERS'!$B$13:$H$13,1,MATCH(ProjectDetails[[#Headers],[DESIGN SPECIALIST]],Parameters[#Headers],0))*ProjectDetails[[#This Row],[ACTUAL\nWORK]]","v":"1910-09-04"},{"$f":"INDEX(Parameters[],MATCH(ProjectDetails[[#This Row],[PROJECT TYPE]],Parameters[PROJECT TYPE],0),MATCH(ProjectDetails[[#Headers],[EVENT STAFF]],Parameters[#Headers],0))*INDEX('PROJECT PARAMETERS'!$B$13:$H$13,1,MATCH(ProjectDetails[[#Headers],[EVENT STAFF]],Parameters[#Headers],0))*ProjectDetails[[#This Row],[ACTUAL\nWORK]]","v":"00:00:00"},{"$f":"INDEX(Parameters[],MATCH(ProjectDetails[[#This Row],[PROJECT TYPE]],Parameters[PROJECT TYPE],0),MATCH(ProjectDetails[[#Headers],[ADMIN STAFF]],Parameters[#Headers],0))*INDEX('PROJECT PARAMETERS'!$B$13:$H$13,1,MATCH(ProjectDetails[[#Headers],[ADMIN STAFF]],Parameters[#Headers],0))*ProjectDetails[[#This Row],[ACTUAL\nWORK]]","v":"1906-05-28"}]
[null,"Project 3","Event design",{"$f":"DATE(YEAR(TODAY())+2,7,12)","v":"2025-07-12"},{"$f":"DATE(YEAR(TODAY())+2,9,19)","v":"2025-09-19"},{"$f":"DATE(YEAR(TODAY())+2,8,7)","v":"2025-08-07"},{"$f":"DATE(YEAR(TODAY())+2,10,25)","v":"2025-10-25"},500,500,{"$f":"DAYS360(ProjectDetails[[#This Row],[ESTIMATED START]],ProjectDetails[[#This Row],[ESTIMATED FINISH]],FALSE)","v":67},{"$f":"DAYS360(ProjectDetails[[#This Row],[ACTUAL\nSTART]],ProjectDetails[[#This Row],[ACTUAL FINISH]],FALSE)","v":78},{"$f":"INDEX(Parameters[],MATCH(ProjectDetails[[#This Row],[PROJECT TYPE]],Parameters[PROJECT TYPE],0),MATCH(ProjectDetails[[#Headers],[ACCOUNT MANAGER]],Parameters[#Headers],0))*INDEX('PROJECT PARAMETERS'!$B$13:$H$13,1,MATCH(ProjectDetails[[#Headers],[ACCOUNT MANAGER]],Parameters[#Headers],0))*ProjectDetails[[#This Row],[ESTIMATED WORK]]","v":"1949-04-12"},{"$f":"INDEX(Parameters[],MATCH(ProjectDetails[[#This Row],[PROJECT TYPE]],Parameters[PROJECT TYPE],0),MATCH(ProjectDetails[[#Headers],[PROJECT MANAGER]],Parameters[#Headers],0))*INDEX('PROJECT PARAMETERS'!$B$13:$H$13,1,MATCH(ProjectDetails[[#Headers],[PROJECT MANAGER]],Parameters[#Headers],0))*ProjectDetails[[#This Row],[ESTIMATED WORK]]","v":"1932-11-07"},{"$f":"INDEX(Parameters[],MATCH(ProjectDetails[[#This Row],[PROJECT TYPE]],Parameters[PROJECT TYPE],0),MATCH(ProjectDetails[[#Headers],[STRATEGY MANAGER]],Parameters[#Headers],0))*INDEX('PROJECT PARAMETERS'!$B$13:$H$13,1,MATCH(ProjectDetails[[#Headers],[STRATEGY MANAGER]],Parameters[#Headers],0))*ProjectDetails[[#This Row],[ESTIMATED WORK]]","v":"00:00:00"},{"$f":"INDEX(Parameters[],MATCH(ProjectDetails[[#This Row],[PROJECT TYPE]],Parameters[PROJECT TYPE],0),MATCH(ProjectDetails[[#Headers],[DESIGN SPECIALIST]],Parameters[#Headers],0))*INDEX('PROJECT PARAMETERS'!$B$13:$H$13,1,MATCH(ProjectDetails[[#Headers],[DESIGN SPECIALIST]],Parameters[#Headers],0))*ProjectDetails[[#This Row],[ESTIMATED WORK]]","v":"1968-06-11"},{"$f":"INDEX(Parameters[],MATCH(ProjectDetails[[#This Row],[PROJECT TYPE]],Parameters[PROJECT TYPE],0),MATCH(ProjectDetails[[#Headers],[EVENT STAFF]],Parameters[#Headers],0))*INDEX('PROJECT PARAMETERS'!$B$13:$H$13,1,MATCH(ProjectDetails[[#Headers],[EVENT STAFF]],Parameters[#Headers],0))*ProjectDetails[[#This Row],[ESTIMATED WORK]]","v":"00:00:00"},{"$f":"INDEX(Parameters[],MATCH(ProjectDetails[[#This Row],[PROJECT TYPE]],Parameters[PROJECT TYPE],0),MATCH(ProjectDetails[[#Headers],[ADMIN STAFF]],Parameters[#Headers],0))*INDEX('PROJECT PARAMETERS'!$B$13:$H$13,1,MATCH(ProjectDetails[[#Headers],[ADMIN STAFF]],Parameters[#Headers],0))*ProjectDetails[[#This Row],[ESTIMATED WORK]]","v":"1908-03-18"},{"$f":"INDEX(Parameters[],MATCH(ProjectDetails[[#This Row],[PROJECT TYPE]],Parameters[PROJECT TYPE],0),MATCH(ProjectDetails[[#Headers],[ACCOUNT MANAGER]],Parameters[#Headers],0))*INDEX('PROJECT PARAMETERS'!$B$13:$H$13,1,MATCH(ProjectDetails[[#Headers],[ACCOUNT MANAGER]],Parameters[#Headers],0))*ProjectDetails[[#This Row],[ACTUAL\nWORK]]","v":"1949-04-12"},{"$f":"INDEX(Parameters[],MATCH(ProjectDetails[[#This Row],[PROJECT TYPE]],Parameters[PROJECT TYPE],0),MATCH(ProjectDetails[[#Headers],[PROJECT MANAGER]],Parameters[#Headers],0))*INDEX('PROJECT PARAMETERS'!$B$13:$H$13,1,MATCH(ProjectDetails[[#Headers],[PROJECT MANAGER]],Parameters[#Headers],0))*ProjectDetails[[#This Row],[ACTUAL\nWORK]]","v":"1932-11-07"},{"$f":"INDEX(Parameters[],MATCH(ProjectDetails[[#This Row],[PROJECT TYPE]],Parameters[PROJECT TYPE],0),MATCH(ProjectDetails[[#Headers],[STRATEGY MANAGER]],Parameters[#Headers],0))*INDEX('PROJECT PARAMETERS'!$B$13:$H$13,1,MATCH(ProjectDetails[[#Headers],[STRATEGY MANAGER]],Parameters[#Headers],0))*ProjectDetails[[#This Row],[ACTUAL\nWORK]]","v":"00:00:00"},{"$f":"INDEX(Parameters[],MATCH(ProjectDetails[[#This Row],[PROJECT TYPE]],Parameters[PROJECT TYPE],0),MATCH(ProjectDetails[[#Headers],[DESIGN SPECIALIST]],Parameters[#Headers],0))*INDEX('PROJECT PARAMETERS'!$B$13:$H$13,1,MATCH(ProjectDetails[[#Headers],[DESIGN SPECIALIST]],Parameters[#Headers],0))*ProjectDetails[[#This Row],[ACTUAL\nWORK]]","v":"1968-06-11"},{"$f":"INDEX(Parameters[],MATCH(ProjectDetails[[#This Row],[PROJECT TYPE]],Parameters[PROJECT TYPE],0),MATCH(ProjectDetails[[#Headers],[EVENT STAFF]],Parameters[#Headers],0))*INDEX('PROJECT PARAMETERS'!$B$13:$H$13,1,MATCH(ProjectDetails[[#Headers],[EVENT STAFF]],Parameters[#Headers],0))*ProjectDetails[[#This Row],[ACTUAL\nWORK]]","v":"00:00:00"},{"$f":"INDEX(Parameters[],MATCH(ProjectDetails[[#This Row],[PROJECT TYPE]],Parameters[PROJECT TYPE],0),MATCH(ProjectDetails[[#Headers],[ADMIN STAFF]],Parameters[#Headers],0))*INDEX('PROJECT PARAMETERS'!$B$13:$H$13,1,MATCH(ProjectDetails[[#Headers],[ADMIN STAFF]],Parameters[#Headers],0))*ProjectDetails[[#This Row],[ACTUAL\nWORK]]","v":"1908-03-18"}]
{"$rows_left_out":4}
{"sheet":"PROJECT TOTALS","index":2,"n_rows":11,"n_cols":17,"rows_kept":11,"merged":[[1,13,1,19],[4,16,10,18]]}
[]
[null,{"$f":"'PROJECT PARAMETERS'!B2","v":"ROBOTINE MANUFACTURING"},{"$nulls":11},{"$f":"'PROJECT PARAMETERS'!G2","v":"ROBOTINE MANUFACTURING:\nCONFIDENTIAL"}]
[null," Event Management Project Tracker"]
[]
[null,"PROJECT NAME","ACCOUNT MANAGER ESTIMATE","PROJECT MANAGER ESTIMATE","STRATEGY MANAGER ESTIMATE","DESIGN SPECIALIST ESTIMATE","EVENT STAFF\nESTIMATE","ADMIN STAFF\nESTIMATE","ACCOUNT MANAGER \nACTUAL","PROJECT MANAGER\nACTUAL","STRATEGY MANAGER\nACTUAL","DESIGN SPECIALIST ACTUAL","EVENT STAFF\nACTUAL","ADMIN STAFF\nACTUAL",null,null,"INFO\n\nThis PivotTable will not refresh automatically.  To refresh it, go to Data Tab in the ribbon and click Refresh All."]
[null,"Project 1",{"v":7200,"d":"$7,200.00"},{"v":2400,"d":"$2,400.00"},{"v":18000,"d":"$18,000.00"},{"v":0,"d":"$0.00"},{"v":0,"d":"$0.00"},{"v":1200,"d":"$1,200.00"},{"v":7920,"d":"$7,920.00"},{"v":2640,"d":"$2,640.00"},{"v":19800,"d":"$19,800.00"},{"v":0,"d":"$0.00"},{"v":0,"d":"$0.00"},{"v":1320,"d":"$1,320.00"}]
[null,"Project 2",{"v":14400,"d":"$14,400.00"},{"v":24000,"d":"$24,000.00"},{"v":6000,"d":"$6,000.00"},{"v":4000,"d":"$4,000.00"},{"v":0,"d":"$0.00"},{"v":2400,"d":"$2,400.00"},{"v":14040,"d":"$14,040.00"},{"v":23400,"d":"$23,400.00"},{"v":5850,"d":"$5,850.00"},{"v":3900,"d":"$3,900.00"},{"v":0,"d":"$0.00"},{"v":2340,"d":"$2,340.00"}]
[null,"Project 3",{"v":18000,"d":"$18,000.00"},{"v":12000,"d":"$12,000.00"},{"v":0,"d":"$0.00"},{"v":25000,"d":"$25,000.00"},{"v":0,"d":"$0.00"},{"v":3000,"d":"$3,000.00"},{"v":18000,"d":"$18,000.00"},{"v":12000,"d":"$12,000.00"},{"v":0,"d":"$0.00"},{"v":25000,"d":"$25,000.00"},{"v":0,"d":"$0.00"},{"v":3000,"d":"$3,000.00"}]
{"$rows_left_out":3}