{"text_format":"3","workbook":"xlsx","n_sheets":3,"sheets":["Training Log","Course List","Personnel Info"],"not_rendered":{"defined_names":13},"read":"whole","date_system":"1900"}

{"sheet":"Training Log","index":0,"n_rows":23,"n_cols":9,"rows_kept":23}
[]
[]
[null,null,"TRAINING LOG"]
{"$rows_empty":8}
[null,null,"DATE OF TRAINING","NAME","COURSE","INSTRUCTOR","TAKEN","PASS/FAIL","NOTES"]
[null,null,"2012-06-01","Kim Abercrombie","Employee Introduction",{"$f":"IF(tblTrainingLog[[#This Row],[COURSE]]=\"\",\"\",IFERROR(VLOOKUP(tblTrainingLog[[#This Row],[COURSE]],tblCourseList[],2,0),\"Not Found\"))","v":"Chris Johnson"},"Yes","Pass","Excellent instructor."]
[null,null,"2012-06-02","Michael Lange","Employee Introduction",{"$f":"IF(tblTrainingLog[[#This Row],[COURSE]]=\"\",\"\",IFERROR(VLOOKUP(tblTrainingLog[[#This Row],[COURSE]],tblCourseList[],2,0),\"Not Found\"))","v":"Chris Johnson"},"Yes","Fail","Had to leave early, not able to complete."]
[null,null,"2012-06-03","Robin Wakefield","Employee Introduction",{"$f":"IF(tblTrainingLog[[#This Row],[COURSE]]=\"\",\"\",IFERROR(VLOOKUP(tblTrainingLog[[#This Row],[COURSE]],tblCourseList[],2,0),\"Not Found\"))","v":"Chris Johnson"},"Yes","Pass","Final offering this quarter."]
[null,null,"2012-06-03","Michael Lange","Employee Introduction",{"$f":"IF(tblTrainingLog[[#This Row],[COURSE]]=\"\",\"\",IFERROR(VLOOKUP(tblTrainingLog[[#This Row],[COURSE]],tblCourseList[],2,0),\"Not Found\"))","v":"Chris Johnson"},"Yes","Pass","Final offering this quarter."]
[null,null,"2012-06-04","Michael Lange","Employee Operations",{"$f":"IF(tblTrainingLog[[#This Row],[COURSE]]=\"\",\"\",IFERROR(VLOOKUP(tblTrainingLog[[#This Row],[COURSE]],tblCourseList[],2,0),\"Not Found\"))","v":"Katie Jordan"},"Yes","Pass","Initial offering for this quarter"]
[null,null,"2012-06-04","Robin Wakefield","Employee Operations",{"$f":"IF(tblTrainingLog[[#This Row],[COURSE]]=\"\",\"\",IFERROR(VLOOKUP(tblTrainingLog[[#This Row],[COURSE]],tblCourseList[],2,0),\"Not Found\"))","v":"Katie Jordan"},"Yes","Pass","Initial offering for this quarter"]
[null,null,"2012-06-04","Robin Wakefield","Intermediate Accounting",{"$f":"IF(tblTrainingLog[[#This Row],[COURSE]]=\"\",\"\",IFERROR(VLOOKUP(tblTrainingLog[[#This Row],[COURSE]],tblCourseList[],2,0),\"Not Found\"))","v":"Katie Jordan"},"Yes","Pass","Closed audience only."]
[null,null,"2012-06-04","Kim Abercrombie","Employee Operations",{"$f":"IF(tblTrainingLog[[#This Row],[COURSE]]=\"\",\"\",IFERROR(VLOOKUP(tblTrainingLog[[#This Row],[COURSE]],tblCourseList[],2,0),\"Not Found\"))","v":"Katie Jordan"},"Yes","Pass","Initial offering for this quarter"]
[null,null,"2012-06-05","Kim Abercrombie","Intermediate Accounting",{"$f":"IF(tblTrainingLog[[#This Row],[COURSE]]=\"\",\"\",IFERROR(VLOOKUP(tblTrainingLog[[#This Row],[COURSE]],tblCourseList[],2,0),\"Not Found\"))","v":"Katie Jordan"},"No","Future","Not taken yet."]
[null,null,"2012-06-05","Michael Lange","Advanced Accounting",{"$f":"IF(tblTrainingLog[[#This Row],[COURSE]]=\"\",\"\",IFERROR(VLOOKUP(tblTrainingLog[[#This Row],[COURSE]],tblCourseList[],2,0),\"Not Found\"))","v":"Chris Johnson"},"No","Future","Not taken yet."]
[{"$nulls":5},{"$f":"IF(tblTrainingLog[[#This Row],[COURSE]]=\"\",\"\",IFERROR(VLOOKUP(tblTrainingLog[[#This Row],[COURSE]],tblCourseList[],2,0),\"Not Found\"))","v":""}]

{"sheet":"Course List","index":1,"n_rows":10,"n_cols":6,"rows_kept":10}
[]
[]
[null,null,"COURSE LIST"]
[]
[null,null,"TITLE","INSTRUCTOR","DESCRIPTION","HOURS"]
[null,null,"Employee Introduction","Chris Johnson","A basic course introduction to new employees.  Defines departmental objectives and expectations, as well as time frames and boundaries.",2]
[null,null,"Employee Operations","Katie Jordan","Basic employee operations, covering the employee handbook.",1]
[null,null,"Employee Operations","Chris Johnson","Basic accounting procedures and guidelines",1.5]
[null,null,"Intermediate Accounting","Katie Jordan","Intermediate accounting procedures and guidelines.",2]
[null,null,"Advanced Accounting","Chris Johnson","Advanced accounting procedures and guidelines.",2]

{"sheet":"Personnel Info","index":2,"n_rows":9,"n_cols":5,"rows_kept":9}
[]
[]
[null,null,"PERSONNEL INFO"]
[]
[null,null,"NAME","DEPARTMENT","TITLE"]
[null,null,"Kim Abercrombie","Sales","Lead Accountant"]
[null,null,"Michael Lange","Accounting","Accountant"]
[null,null,"Robin Wakefield","Accounting","Accountant"]
[null,null,"Katarina Larsson","Accounting","Accountant"]