{"text_format":"3","workbook":"xlsx","n_sheets":2,"sheets":["Employee Timesheet","Weekday_Lookup"],"not_rendered":{"defined_names":27},"read":"whole","date_system":"1900"}

{"sheet":"Employee Timesheet","index":0,"n_rows":36,"n_cols":26,"rows_kept":36,"merged":[[0,1,2,4],[0,5,2,9],[0,10,2,14],[0,15,3,23],[0,24,3,24],[3,1,3,3],[3,5,3,9],[3,10,3,14],[4,1,6,3],[4,4,6,6],[5,14,7,14],[5,22,7,22],[5,23,7,23],[5,24,7,24],[21,1,21,6],[22,1,23,3],[22,4,23,6],[23,14,24,14],[23,22,24,22],[23,23,24,23],[23,24,24,24],[32,1,32,6],[32,24,33,24],[32,25,33,25],[33,1,33,6],[34,1,34,6],[35,1,35,3],[35,4,35,5],[35,6,35,7],[35,8,35,14],[35,15,35,16],[35,17,35,23]]}
[null,"OPERATIONS EMPLOYEE TIMESHEET",{"$nulls":3},"Employee Name",{"$nulls":9},"Select Yes in cell to the right, if overtime \nauthorisation is required"]
[]
[]
[null,"Payroll Ending Date",null,null,{"$f":"V7","v":"2025-06-14"},"Employee Number"]
[null,"REGULAR HOURS:",null,null,"Date:"]
[{"$nulls":14},"Total\nWeek 1\nRegular",{"$nulls":7},"Total\nWeek 2\nRegular","Total\nRegular\nHours","Payroll\nUse Only\nPay Code"]
[{"$nulls":7},"2025-06-01",{"$f":"Day_One+1","v":"2025-06-02"},{"$f":"Day_One+2","v":"2025-06-03"},{"$f":"Day_One+3","v":"2025-06-04"},{"$f":"Day_One+4","v":"2025-06-05"},{"$f":"Day_One+5","v":"2025-06-06"},{"$f":"Day_One+6","v":"2025-06-07"},null,{"$f":"Day_One+7","v":"2025-06-08"},{"$f":"Day_One+8","v":"2025-06-09"},{"$f":"Day_One+9","v":"2025-06-10"},{"$f":"Day_One+10","v":"2025-06-11"},{"$f":"Day_One+11","v":"2025-06-12"},{"$f":"Day_One+12","v":"2025-06-13"},{"$f":"Day_One+13","v":"2025-06-14"}]
[null,"Task","Loc","WO no.","Work Description","Job title","Title no.",{"$f":"VLOOKUP(WEEKDAY(Day_One),Weekday_Lookup!$B$2:$C$8,2)","v":"Sun"},{"$f":"VLOOKUP(WEEKDAY(I7),Weekday_Lookup!$B$2:$C$8,2)","v":"Mon"},{"$f":"VLOOKUP(WEEKDAY(J7),Weekday_Lookup!$B$2:$C$8,2)","v":"Tue"},{"$f":"VLOOKUP(WEEKDAY(K7),Weekday_Lookup!$B$2:$C$8,2)","v":"Wed"},{"$f":"VLOOKUP(WEEKDAY(L7),Weekday_Lookup!$B$2:$C$8,2)","v":"Thu"},{"$f":"VLOOKUP(WEEKDAY(M7),Weekday_Lookup!$B$2:$C$8,2)","v":"Fri"},{"$f":"VLOOKUP(WEEKDAY(N7),Weekday_Lookup!$B$2:$C$8,2)","v":"Sat"},null,{"$f":"VLOOKUP(WEEKDAY(P7),Weekday_Lookup!$B$2:$C$8,2)","v":"Sun"},{"$f":"VLOOKUP(WEEKDAY(Q7),Weekday_Lookup!$B$2:$C$8,2)","v":"Mon"},{"$f":"VLOOKUP(WEEKDAY(R7),Weekday_Lookup!$B$2:$C$8,2)","v":"Tue"},{"$f":"VLOOKUP(WEEKDAY(S7),Weekday_Lookup!$B$2:$C$8,2)","v":"Wed"},{"$f":"VLOOKUP(WEEKDAY(T7),Weekday_Lookup!$B$2:$C$8,2)","v":"Thu"},{"$f":"VLOOKUP(WEEKDAY(U7),Weekday_Lookup!$B$2:$C$8,2)","v":"Fri"},{"$f":"VLOOKUP(WEEKDAY(V7),Weekday_Lookup!$B$2:$C$8,2)","v":"Sat"}]
[{"$nulls":14},{"$f":"SUM(H9:N9)","v":{"v":0,"d":"0.00"}},{"$nulls":7},{"$f":"SUM(P9:V9)","v":{"v":0,"d":"0.00"}},{"$f":"O9+W9","v":{"v":0,"d":"0.00"}}]
[{"$nulls":14},{"v":0,"d":"0.00"},{"$nulls":7},{"v":0,"d":"0.00"},{"v":0,"d":"0.00"}]
[{"$nulls":14},{"v":0,"d":"0.00"},{"$nulls":7},{"v":0,"d":"0.00"},{"v":0,"d":"0.00"}]
[{"$nulls":14},{"v":0,"d":"0.00"},{"$nulls":7},{"v":0,"d":"0.00"},{"v":0,"d":"0.00"}]
[{"$nulls":14},{"v":0,"d":"0.00"},{"$nulls":7},{"v":0,"d":"0.00"},{"v":0,"d":"0.00"}]
[{"$nulls":14},{"v":0,"d":"0.00"},{"$nulls":7},{"v":0,"d":"0.00"},{"v":0,"d":"0.00"}]
[{"$nulls":14},{"v":0,"d":"0.00"},{"$nulls":7},{"v":0,"d":"0.00"},{"v":0,"d":"0.00"}]
[{"$nulls":14},{"$f":"SUM(H16:N16)","v":{"v":0,"d":"0.00"}},{"$nulls":7},{"$f":"SUM(P16:V16)","v":{"v":0,"d":"0.00"}},{"$f":"O16+W16","v":{"v":0,"d":"0.00"}}]
[{"$nulls":14},{"v":0,"d":"0.00"},{"$nulls":7},{"v":0,"d":"0.00"},{"v":0,"d":"0.00"}]
[{"$nulls":14},{"v":0,"d":"0.00"},{"$nulls":7},{"v":0,"d":"0.00"},{"v":0,"d":"0.00"}]
[{"$nulls":14},{"v":0,"d":"0.00"},{"$nulls":7},{"v":0,"d":"0.00"},{"v":0,"d":"0.00"}]
[{"$nulls":14},{"v":0,"d":"0.00"},{"$nulls":7},{"v":0,"d":"0.00"},{"v":0,"d":"0.00"}]
[{"$nulls":14},{"v":0,"d":"0.00"},{"$nulls":7},{"v":0,"d":"0.00"},{"v":0,"d":"0.00"}]
[null,"Total Regular Hours   ",{"$nulls":5},{"$f":"SUM(H9:H21)","v":{"v":0,"d":"0.00"}},{"v":0,"d":"0.00"},{"v":0,"d":"0.00"},{"v":0,"d":"0.00"},{"v":0,"d":"0.00"},{"v":0,"d":"0.00"},{"v":0,"d":"0.00"},{"v":0,"d":"0.00"},{"v":0,"d":"0.00"},{"$f":"SUM(Q9:Q21)","v":{"v":0,"d":"0.00"}},{"v":0,"d":"0.00"},{"v":0,"d":"0.00"},{"v":0,"d":"0.00"},{"v":0,"d":"0.00"},{"v":0,"d":"0.00"},{"$f":"SUM(W9:W21)","v":{"v":0,"d":"0.00"}},{"$f":"SUM(X9:X21)","v":{"v":0,"d":"0.00"}}]
[null,"OVERTIME HOURS:",null,null,"Date:"]
[{"$nulls":7},{"$f":"Day_One","v":"2025-06-01"},{"$f":"Day_One+1","v":"2025-06-02"},{"$f":"Day_One+2","v":"2025-06-03"},{"$f":"Day_One+3","v":"2025-06-04"},{"$f":"Day_One+4","v":"2025-06-05"},{"$f":"Day_One+5","v":"2025-06-06"},{"$f":"Day_One+6","v":"2025-06-07"},"Week 1 O/T",{"$f":"Day_One+7","v":"2025-06-08"},{"$f":"Day_One+8","v":"2025-06-09"},{"$f":"Day_One+9","v":"2025-06-10"},{"$f":"Day_One+10","v":"2025-06-11"},{"$f":"Day_One+11","v":"2025-06-12"},{"$f":"Day_One+12","v":"2025-06-13"},{"$f":"Day_One+13","v":"2025-06-14"},"Week 2 O/T","Total O/T","Overtime\nCODE"]
[null,"Task","Loc","WO no.","Work Description","Job title","Title no.",{"$f":"VLOOKUP(WEEKDAY(Day_One),Weekday_Lookup!$B$2:$C$8,2)","v":"Sun"},{"$f":"VLOOKUP(WEEKDAY(I24),Weekday_Lookup!$B$2:$C$8,2)","v":"Mon"},{"$f":"VLOOKUP(WEEKDAY(J24),Weekday_Lookup!$B$2:$C$8,2)","v":"Tue"},{"$f":"VLOOKUP(WEEKDAY(K24),Weekday_Lookup!$B$2:$C$8,2)","v":"Wed"},{"$f":"VLOOKUP(WEEKDAY(L24),Weekday_Lookup!$B$2:$C$8,2)","v":"Thu"},{"$f":"VLOOKUP(WEEKDAY(M24),Weekday_Lookup!$B$2:$C$8,2)","v":"Fri"},{"$f":"VLOOKUP(WEEKDAY(N24),Weekday_Lookup!$B$2:$C$8,2)","v":"Sat"},null,{"$f":"VLOOKUP(WEEKDAY(P24),Weekday_Lookup!$B$2:$C$8,2)","v":"Sun"},{"$f":"VLOOKUP(WEEKDAY(Q24),Weekday_Lookup!$B$2:$C$8,2)","v":"Mon"},{"$f":"VLOOKUP(WEEKDAY(R24),Weekday_Lookup!$B$2:$C$8,2)","v":"Tue"},{"$f":"VLOOKUP(WEEKDAY(S24),Weekday_Lookup!$B$2:$C$8,2)","v":"Wed"},{"$f":"VLOOKUP(WEEKDAY(T24),Weekday_Lookup!$B$2:$C$8,2)","v":"Thu"},{"$f":"VLOOKUP(WEEKDAY(U24),Weekday_Lookup!$B$2:$C$8,2)","v":"Fri"},{"$f":"VLOOKUP(WEEKDAY(V24),Weekday_Lookup!$B$2:$C$8,2)","v":"Sat"}]
[{"$nulls":14},{"$f":"SUM(H26:N26)","v":{"v":0,"d":"0.00"}},{"$nulls":7},{"$f":"SUM(P26:V26)","v":{"v":0,"d":"0.00"}},{"$f":"O26+W26","v":{"v":0,"d":"0.00"}}]
[{"$nulls":14},{"v":0,"d":"0.00"},{"$nulls":7},{"v":0,"d":"0.00"},{"v":0,"d":"0.00"}]
[{"$nulls":14},{"v":0,"d":"0.00"},{"$nulls":7},{"v":0,"d":"0.00"},{"v":0,"d":"0.00"}]
[{"$nulls":14},{"v":0,"d":"0.00"},{"$nulls":7},{"v":0,"d":"0.00"},{"v":0,"d":"0.00"}]
[{"$nulls":14},{"v":0,"d":"0.00"},{"$nulls":7},{"v":0,"d":"0.00"},{"v":0,"d":"0.00"}]
[{"$nulls":14},{"v":0,"d":"0.00"},{"$nulls":7},{"v":0,"d":"0.00"},{"v":0,"d":"0.00"}]
[{"$nulls":14},{"v":0,"d":"0.00"},{"$nulls":7},{"v":0,"d":"0.00"},{"v":0,"d":"0.00"}]
[null,"Total Overtime Hours     ",{"$nulls":5},{"$f":"SUM(H26:H32)","v":{"v":0,"d":"0.00"}},{"v":0,"d":"0.00"},{"v":0,"d":"0.00"},{"v":0,"d":"0.00"},{"v":0,"d":"0.00"},{"v":0,"d":"0.00"},{"v":0,"d":"0.00"},{"$f":"SUM(O26:O32)","v":{"v":0,"d":"0.00"}},{"v":0,"d":"0.00"},{"v":0,"d":"0.00"},{"v":0,"d":"0.00"},{"v":0,"d":"0.00"},{"v":0,"d":"0.00"},{"v":0,"d":"0.00"},{"v":0,"d":"0.00"},{"$f":"SUM(P33:V33)","v":{"v":0,"d":"0.00"}},{"$f":"SUM(X26:X32)","v":{"v":0,"d":"0.00"}},"Total\nHours\nWorked","Total\nHours\nPaid"]
[null,"Overtime Comp     ",{"$nulls":12},{"$f":"IF(SUM(H34:N34)<=O33,SUM(H34:N34),O33)","v":{"v":0,"d":"0.00"}},{"$nulls":7},{"$f":"IF(SUM(P34:V34)<=W33,SUM(P34:V34),W33)","v":{"v":0,"d":"0.00"}},{"$f":"IF(SUM(Q34:W34)<=X33,SUM(Q34:W34),X33)","v":{"v":0,"d":"0.00"}}]
[null,"Overtime Paid     ",{"$nulls":5},{"$f":"IF(H33>=H34,H33-H34,H33)","v":{"v":0,"d":"0.00"}},{"$f":"IF(I33>=I34,I33-I34,I33)","v":{"v":0,"d":"0.00"}},{"v":0,"d":"0.00"},{"v":0,"d":"0.00"},{"v":0,"d":"0.00"},{"v":0,"d":"0.00"},{"v":0,"d":"0.00"},{"v":0,"d":"0.00"},{"v":0,"d":"0.00"},{"v":0,"d":"0.00"},{"v":0,"d":"0.00"},{"v":0,"d":"0.00"},{"v":0,"d":"0.00"},{"v":0,"d":"0.00"},{"v":0,"d":"0.00"},{"$f":"IF(W33>=W34,W33-W34,W33)","v":{"v":0,"d":"0.00"}},{"$f":"IF(X33>=X34,X33-X34,X33)","v":{"v":0,"d":"0.00"}},{"$f":"$X$22+$X$33","v":{"v":0,"d":"0.00"}},{"$f":"X22+X35","v":{"v":0,"d":"0.00"}}]
[null,"Employee ",{"$nulls":4},"Supervisor ",{"$nulls":8},"Supervisor "]

{"sheet":"Weekday_Lookup","index":1,"n_rows":8,"n_cols":3,"rows_kept":8}
[null,"Weekday\nInteger","Weekday\nInitial"]
[null,1,"Sun"]
[null,2,"Mon"]
[null,3,"Tue"]
[null,4,"Wed"]
[null,5,"Thu"]
[null,6,"Fri"]
[null,7,"Sat"]