{"text_format":"3","workbook":"xlsx","n_sheets":4,"sheets":["Παρακολούθηση βαθμολογίας","Οι επιδόσεις σας","Ρυθμίσεις","Υπολογισμοί"],"not_rendered":{"defined_names":3,"comments":1},"read":"whole","date_system":"1900"}

{"sheet":"Παρακολούθηση βαθμολογίας","index":0,"n_rows":14,"n_cols":6,"rows_kept":14}
[null,"Πληκτρολογήστε τις βαθμολογίες σας εδώ"]
[]
[null,null,"Μάθημα","Τύπος","Περιγραφή","Βαθμολογία"]
[null,null,"Γαλλικά","Εργασία για το σπίτι","Ιστορία 2ου ΠΠ",{"v":0.8,"d":"80%"}]
[null,null,"Προχωρημένος προγραμματισμός σε Java","Εξάμηνο",null,{"v":0.75,"d":"75%"}]
[null,null,"Ισπανικά","Εργασία για το σπίτι",null,{"v":0.5,"d":"50%"}]
[null,null,"Θεωρητική Φυσική","Εργασία για το σπίτι",null,{"v":0.95,"d":"95%"}]
[null,null,"Γαλλικά","Εργασία για το σπίτι","Ιστορία 1ου ΠΠ",{"v":0.9,"d":"90%"}]
[null,null,"Γαλλικά","Εργασία για το σπίτι","Σελίδες 30 - 41",{"v":0.8,"d":"80%"}]
[null,null,"Έκθεση","Εργασία","Πραγματεία",{"v":0.95,"d":"95%"}]
[null,null,"Μαθηματικά 1","Εργασία για το σπίτι","Σελίδες 21 και 26",{"v":0.8,"d":"80%"}]
[null,null,"Μαθηματικά 2","Εργασία για το σπίτι","Σελίδες 15 και 18",{"v":0.85,"d":"85%"}]
[null,null,"Μαθηματικά 1","Εργασία για το σπίτι","Σελίδες 34 - 36",{"v":0.8,"d":"80%"}]
[null,null,"Μαθηματικά 2","Διαγώνισμα",null,{"v":0.95,"d":"95%"}]

{"sheet":"Οι επιδόσεις σας","index":1,"n_rows":31,"n_cols":8,"rows_kept":31}
[null,"Οι επιδόσεις σας"]
[]
[null,null,"Σύνολα"]
[null,null,{"$f":"\"Ώρες: \"&SUM(tblClasses[Ώρες παρακολούθησης])","v":"Ώρες: 24"},{"$f":"AVERAGE(D7:D31)","v":{"v":0.8104761904761906,"d":"81%"}},{"$f":"AVERAGE(E7:E31)","v":{"v":2.7142857142857144,"d":"2.71"}},{"$f":"SUM(F7:F31)","v":{"v":2.625,"d":"2.63"}},{"$f":"IFERROR(HLOOKUP(D4,lstGPAMapping,2),\"\")","v":"B-"}]
[]
[null,null,"Μαθήματα","%","Μέσος όρος","Σταθμ. μέσος όρος","Γράμμα","Συνολική επίδοση"]
[null,null,{"$f":"Υπολογισμοί!C6","v":"Γαλλικά"},{"$f":"Υπολογισμοί!AL6","v":{"v":0.8333333333333334,"d":"83%"}},{"$f":"Υπολογισμοί!AM6","v":{"v":3,"d":"3.00"}},{"$f":"IFERROR(E7*Ρυθμίσεις!D9/SUM(tblClasses[Ώρες παρακολούθησης]),\"\")","v":{"v":0.375,"d":"0.38"}},{"$f":"Υπολογισμοί!AN6","v":"B"}]
[null,null,{"$f":"Υπολογισμοί!C7","v":"Θεωρητική Φυσική"},{"$f":"Υπολογισμοί!AL7","v":{"v":0.95,"d":"95%"}},{"$f":"Υπολογισμοί!AM7","v":{"v":4,"d":"4.00"}},{"$f":"IFERROR(E8*Ρυθμίσεις!D10/SUM(tblClasses[Ώρες παρακολούθησης]),\"\")","v":{"v":0.5,"d":"0.50"}},{"$f":"Υπολογισμοί!AN7","v":"A"}]
[null,null,{"$f":"Υπολογισμοί!C8","v":"Μαθηματικά 1"},{"$f":"Υπολογισμοί!AL8","v":{"v":0.8000000000000002,"d":"80%"}},{"$f":"Υπολογισμοί!AM8","v":2.67},{"$f":"IFERROR(E9*Ρυθμίσεις!D11/SUM(tblClasses[Ώρες παρακολούθησης]),\"\")","v":{"v":0.445,"d":"0.45"}},{"$f":"Υπολογισμοί!AN8","v":"B-"}]
[null,null,{"$f":"Υπολογισμοί!C9","v":"Μαθηματικά 2"},{"$f":"Υπολογισμοί!AL9","v":{"v":0.89,"d":"89%"}},{"$f":"Υπολογισμοί!AM9","v":3.33},{"$f":"IFERROR(E10*Ρυθμίσεις!D12/SUM(tblClasses[Ώρες παρακολούθησης]),\"\")","v":{"v":0.555,"d":"0.56"}},{"$f":"Υπολογισμοί!AN9","v":"B+"}]
[null,null,{"$f":"Υπολογισμοί!C10","v":"Προχωρημένος προγραμματισμός σε Java"},{"$f":"Υπολογισμοί!AL10","v":{"v":0.7500000000000001,"d":"75%"}},{"$f":"Υπολογισμοί!AM10","v":{"v":2,"d":"2.00"}},{"$f":"IFERROR(E11*Ρυθμίσεις!D13/SUM(tblClasses[Ώρες παρακολούθησης]),\"\")","v":{"v":0.4166666666666667,"d":"0.42"}},{"$f":"Υπολογισμοί!AN10","v":"C"}]
[null,null,{"$f":"Υπολογισμοί!C11","v":"Ισπανικά"},{"$f":"Υπολογισμοί!AL11","v":{"v":0.5,"d":"50%"}},{"$f":"Υπολογισμοί!AM11","v":{"v":0,"d":"0.00"}},{"$f":"IFERROR(E12*Ρυθμίσεις!D14/SUM(tblClasses[Ώρες παρακολούθησης]),\"\")","v":{"v":0,"d":"0.00"}},{"$f":"Υπολογισμοί!AN11","v":"F"}]
[null,null,{"$f":"Υπολογισμοί!C12","v":"Έκθεση"},{"$f":"Υπολογισμοί!AL12","v":{"v":0.95,"d":"95%"}},{"$f":"Υπολογισμοί!AM12","v":{"v":4,"d":"4.00"}},{"$f":"IFERROR(E13*Ρυθμίσεις!D15/SUM(tblClasses[Ώρες παρακολούθησης]),\"\")","v":{"v":0.3333333333333333,"d":"0.33"}},{"$f":"Υπολογισμοί!AN12","v":"A"}]
[null,null,{"$f":"Υπολογισμοί!C13","v":""},{"$f":"Υπολογισμοί!AL13","v":""},{"$f":"Υπολογισμοί!AM13","v":""},{"$f":"IFERROR(E14*Ρυθμίσεις!D16/SUM(tblClasses[Ώρες παρακολούθησης]),\"\")","v":""},{"$f":"Υπολογισμοί!AN13","v":""}]
[null,null,{"$f":"Υπολογισμοί!C14","v":""},{"$f":"Υπολογισμοί!AL14","v":""},{"$f":"Υπολογισμοί!AM14","v":""},{"$f":"IFERROR(E15*Ρυθμίσεις!D17/SUM(tblClasses[Ώρες παρακολούθησης]),\"\")","v":""},{"$f":"Υπολογισμοί!AN14","v":""}]
{"$rows_left_out":17}
{"sheet":"Ρυθμίσεις","index":2,"n_rows":15,"n_cols":16,"rows_kept":15,"merged":[[5,2,5,15]]}
[null,"Ρυθμίσεις"]
[null,null,"Βαθμολογίες και αντιστοίχιση μέσου όρου"]
[null,null,"Ποσοστό",{"v":0,"d":"0%"},{"v":0.6,"d":"60%"},{"v":0.63,"d":"63%"},{"v":0.67,"d":"67%"},{"v":0.7,"d":"70%"},{"v":0.73,"d":"73%"},{"v":0.77,"d":"77%"},{"v":0.8,"d":"80%"},{"v":0.83,"d":"83%"},{"v":0.87,"d":"87%"},{"v":0.9,"d":"90%"},{"v":0.93,"d":"93%"},{"v":0.97,"d":"97%"}]
[null,null,"Αλφαβητικός βαθμός","F","D-","D","D+","C-","C","C+","B-","B","B+","A-","A","A+"]
[null,null,"Μέσος όρος",0,0.67,1,1.33,1.67,2,2.33,2.67,3,3.33,3.67,4,4]
[]
[null,null,"Σταθμισμένες βαθμολογίες για έως και 25 μαθήματα"]
[null,null,"Μαθήματα που παρακολουθείτε","Ώρες παρακολούθησης","Εργασία για το σπίτι","Έκθεση-δοκίμιο","Διαγώνισμα","Εργασία","Εξάμηνο","Τελική εξέταση","Άλλο","% συνόλου"]
[null,null,"Γαλλικά",{"v":3,"d":"3.0"},{"v":0.1,"d":"10%"},{"v":0.15,"d":"15%"},{"v":0.15,"d":"15%"},{"v":0.1,"d":"10%"},{"v":0.2,"d":"20%"},{"v":0.3,"d":"30%"},null,{"$f":"SUM(tblClasses[[#This Row],[Εργασία για το σπίτι]:[Άλλο]])","v":{"v":1,"d":"100%"}}]
[null,null,"Θεωρητική Φυσική",{"v":3,"d":"3.0"},{"v":0.15,"d":"15%"},{"v":0.15,"d":"15%"},{"v":0.1,"d":"10%"},{"v":0.1,"d":"10%"},{"v":0.15,"d":"15%"},{"v":0.3,"d":"30%"},{"v":0.05,"d":"5%"},{"$f":"SUM(tblClasses[[#This Row],[Εργασία για το σπίτι]:[Άλλο]])","v":{"v":1,"d":"100%"}}]
[null,null,"Μαθηματικά 1",{"v":4,"d":"4.0"},{"v":0.1,"d":"10%"},{"v":0.15,"d":"15%"},{"v":0.15,"d":"15%"},{"v":0.1,"d":"10%"},{"v":0.2,"d":"20%"},{"v":0.3,"d":"30%"},null,{"$f":"SUM(tblClasses[[#This Row],[Εργασία για το σπίτι]:[Άλλο]])","v":{"v":1,"d":"100%"}}]
[null,null,"Μαθηματικά 2",{"v":4,"d":"4.0"},{"v":0.15,"d":"15%"},{"v":0.15,"d":"15%"},{"v":0.1,"d":"10%"},{"v":0.1,"d":"10%"},{"v":0.15,"d":"15%"},{"v":0.3,"d":"30%"},{"v":0.05,"d":"5%"},{"$f":"SUM(tblClasses[[#This Row],[Εργασία για το σπίτι]:[Άλλο]])","v":{"v":1,"d":"100%"}}]
[null,null,"Προχωρημένος προγραμματισμός σε Java",{"v":5,"d":"5.0"},{"v":0.15,"d":"15%"},{"v":0.15,"d":"15%"},{"v":0.1,"d":"10%"},{"v":0.1,"d":"10%"},{"v":0.2,"d":"20%"},{"v":0.3,"d":"30%"},null,{"$f":"SUM(tblClasses[[#This Row],[Εργασία για το σπίτι]:[Άλλο]])","v":{"v":1,"d":"100%"}}]
[null,null,"Ισπανικά",{"v":3,"d":"3.0"},{"v":0.1,"d":"10%"},{"v":0.15,"d":"15%"},{"v":0.17,"d":"17%"},{"v":0.13,"d":"13%"},{"v":0.2,"d":"20%"},{"v":0.2,"d":"20%"},{"v":0.05,"d":"5%"},{"$f":"SUM(tblClasses[[#This Row],[Εργασία για το σπίτι]:[Άλλο]])","v":{"v":1,"d":"100%"}}]
[null,null,"Έκθεση",{"v":2,"d":"2.0"},{"v":0.15,"d":"15%"},{"v":0.15,"d":"15%"},{"v":0.12,"d":"12%"},{"v":0.15,"d":"15%"},{"v":0.15,"d":"15%"},{"v":0.25,"d":"25%"},{"v":0.03,"d":"3%"},{"$f":"SUM(tblClasses[[#This Row],[Εργασία για το σπίτι]:[Άλλο]])","v":{"v":1,"d":"100%"}}]
{"$rows_left_out":1}
{"sheet":"Υπολογισμοί","index":3,"n_rows":657,"n_cols":40,"rows_kept":657,"hidden":true}
[null,"Υπολογισμοί"]
[null,null,"Αυτό το φύλλο εργασίας παρέχει υπολογισμούς για τους βαθμούς και το μέσο όρο σας και πρέπει να παραμείνει κρυφό. Τυχόν αλλαγές σε αυτό το φύλλο ενδέχεται να προκαλέσουν σφάλματα."]
[]
[null,null,"Τρέχουσα λίστα μαθημάτων","Βαθμολογίες (από 1)",{"$nulls":24},"Υπολογισμός βαθμολογίας"]
[null,null,"Μάθημα",1,2,3,4,5,6,7,8,9,10,11,12,13,14,15,16,17,18,19,20,21,22,23,24,25,{"$f":"tblClasses[[#Headers],[Εργασία για το σπίτι]]","v":"Εργασία για το σπίτι"},{"$f":"tblClasses[[#Headers],[Έκθεση-δοκίμιο]]","v":"Έκθεση-δοκίμιο"},{"$f":"tblClasses[[#Headers],[Διαγώνισμα]]","v":"Διαγώνισμα"},{"$f":"tblClasses[[#Headers],[Εργασία]]","v":"Εργασία"},{"$f":"tblClasses[[#Headers],[Εξάμηνο]]","v":"Εξάμηνο"},{"$f":"tblClasses[[#Headers],[Τελική εξέταση]]","v":"Τελική εξέταση"},{"$f":"tblClasses[[#Headers],[Άλλο]]","v":"Άλλο"},"Σύνολο","Οι πιθανές συνολικές μονάδες","Συνολικό %","Βαθμοί","Αλφαβητικός βαθμός"]
[null,null,"Γαλλικά",{"$f":"IFERROR(INDEX(tblClassScores[],MATCH($C6:$C30&D$5:AB$5,Υπολογισμοί!$C$33:$C$657,0),4),\"\")","v":{"v":0.8,"d":"80%"}},{"v":0.9,"d":"90%"},{"v":0.8,"d":"80%"},"","","","","","","","","","","","","","","","","","","","","","",{"$f":"IFERROR(AVERAGEIFS(tblClassScores[Βαθμολογία],tblClassScores[Μάθημα],Υπολογισμοί!$C6,tblClassScores[Τύπος],Υπολογισμοί!AC$5)*Ρυθμίσεις!E9,\"\")","v":0.08333333333333334},{"$f":"IFERROR(AVERAGEIFS(tblClassScores[Βαθμολογία],tblClassScores[Μάθημα],Υπολογισμοί!$C6,tblClassScores[Τύπος],Υπολογισμοί!AD$5)*Ρυθμίσεις!F9,\"\")","v":""},{"$f":"IFERROR(AVERAGEIFS(tblClassScores[Βαθμολογία],tblClassScores[Μάθημα],Υπολογισμοί!$C6,tblClassScores[Τύπος],Υπολογισμοί!AE$5)*Ρυθμίσεις!G9,\"\")","v":""},{"$f":"IFERROR(AVERAGEIFS(tblClassScores[Βαθμολογία],tblClassScores[Μάθημα],Υπολογισμοί!$C6,tblClassScores[Τύπος],Υπολογισμοί!AF$5)*Ρυθμίσεις!H9,\"\")","v":""},{"$f":"IFERROR(AVERAGEIFS(tblClassScores[Βαθμολογία],tblClassScores[Μάθημα],Υπολογισμοί!$C6,tblClassScores[Τύπος],Υπολογισμοί!AG$5)*Ρυθμίσεις!I9,\"\")","v":""},{"$f":"IFERROR(AVERAGEIFS(tblClassScores[Βαθμολογία],tblClassScores[Μάθημα],Υπολογισμοί!$C6,tblClassScores[Τύπος],Υπολογισμοί!AH$5)*Ρυθμίσεις!J9,\"\")","v":""},{"$f":"IFERROR(AVERAGEIFS(tblClassScores[Βαθμολογία],tblClassScores[Μάθημα],Υπολογισμοί!$C6,tblClassScores[Τύπος],Υπολογισμοί!AI$5)*Ρυθμίσεις!K9,\"\")","v":""},{"$f":"SUM(AC6:AI6)","v":0.08333333333333334},{"$f":"SUMIFS(Ρυθμίσεις!E9:K9,Υπολογισμοί!AC6:AI6,\">0\")","v":0.1},{"$f":"IFERROR(AJ6/AK6,\"\")","v":{"v":0.8333333333333334,"d":"83%"}},{"$f":"IFERROR(HLOOKUP(AL6,lstGPAMapping,3),\"\")","v":3},{"$f":"IFERROR(HLOOKUP(AL6,lstGPAMapping,2),\"\")","v":"B"}]
[null,null,"Θεωρητική Φυσική",{"v":0.95,"d":"95%"},"","","","","","","","","","","","","","","","","","","","","","","","",{"$f":"IFERROR(AVERAGEIFS(tblClassScores[Βαθμολογία],tblClassScores[Μάθημα],Υπολογισμοί!$C7,tblClassScores[Τύπος],Υπολογισμοί!AC$5)*Ρυθμίσεις!E10,\"\")","v":0.1425},{"$f":"IFERROR(AVERAGEIFS(tblClassScores[Βαθμολογία],tblClassScores[Μάθημα],Υπολογισμοί!$C7,tblClassScores[Τύπος],Υπολογισμοί!AD$5)*Ρυθμίσεις!F10,\"\")","v":""},{"$f":"IFERROR(AVERAGEIFS(tblClassScores[Βαθμολογία],tblClassScores[Μάθημα],Υπολογισμοί!$C7,tblClassScores[Τύπος],Υπολογισμοί!AE$5)*Ρυθμίσεις!G10,\"\")","v":""},{"$f":"IFERROR(AVERAGEIFS(tblClassScores[Βαθμολογία],tblClassScores[Μάθημα],Υπολογισμοί!$C7,tblClassScores[Τύπος],Υπολογισμοί!AF$5)*Ρυθμίσεις!H10,\"\")","v":""},{"$f":"IFERROR(AVERAGEIFS(tblClassScores[Βαθμολογία],tblClassScores[Μάθημα],Υπολογισμοί!$C7,tblClassScores[Τύπος],Υπολογισμοί!AG$5)*Ρυθμίσεις!I10,\"\")","v":""},{"$f":"IFERROR(AVERAGEIFS(tblClassScores[Βαθμολογία],tblClassScores[Μάθημα],Υπολογισμοί!$C7,tblClassScores[Τύπος],Υπολογισμοί!AH$5)*Ρυθμίσεις!J10,\"\")","v":""},{"$f":"IFERROR(AVERAGEIFS(tblClassScores[Βαθμολογία],tblClassScores[Μάθημα],Υπολογισμοί!$C7,tblClassScores[Τύπος],Υπολογισμοί!AI$5)*Ρυθμίσεις!K10,\"\")","v":""},{"$f":"SUM(AC7:AI7)","v":0.1425},{"$f":"SUMIFS(Ρυθμίσεις!E10:K10,Υπολογισμοί!AC7:AI7,\">0\")","v":0.15},{"$f":"IFERROR(AJ7/AK7,\"\")","v":{"v":0.95,"d":"95%"}},4,"A"]
[null,null,"Μαθηματικά 1",{"v":0.8,"d":"80%"},{"v":0.8,"d":"80%"},"","","","","","","","","","","","","","","","","","","","","","","",{"$f":"IFERROR(AVERAGEIFS(tblClassScores[Βαθμολογία],tblClassScores[Μάθημα],Υπολογισμοί!$C8,tblClassScores[Τύπος],Υπολογισμοί!AC$5)*Ρυθμίσεις!E11,\"\")","v":0.08000000000000002},{"$f":"IFERROR(AVERAGEIFS(tblClassScores[Βαθμολογία],tblClassScores[Μάθημα],Υπολογισμοί!$C8,tblClassScores[Τύπος],Υπολογισμοί!AD$5)*Ρυθμίσεις!F11,\"\")","v":""},{"$f":"IFERROR(AVERAGEIFS(tblClassScores[Βαθμολογία],tblClassScores[Μάθημα],Υπολογισμοί!$C8,tblClassScores[Τύπος],Υπολογισμοί!AE$5)*Ρυθμίσεις!G11,\"\")","v":""},{"$f":"IFERROR(AVERAGEIFS(tblClassScores[Βαθμολογία],tblClassScores[Μάθημα],Υπολογισμοί!$C8,tblClassScores[Τύπος],Υπολογισμοί!AF$5)*Ρυθμίσεις!H11,\"\")","v":""},{"$f":"IFERROR(AVERAGEIFS(tblClassScores[Βαθμολογία],tblClassScores[Μάθημα],Υπολογισμοί!$C8,tblClassScores[Τύπος],Υπολογισμοί!AG$5)*Ρυθμίσεις!I11,\"\")","v":""},{"$f":"IFERROR(AVERAGEIFS(tblClassScores[Βαθμολογία],tblClassScores[Μάθημα],Υπολογισμοί!$C8,tblClassScores[Τύπος],Υπολογισμοί!AH$5)*Ρυθμίσεις!J11,\"\")","v":""},{"$f":"IFERROR(AVERAGEIFS(tblClassScores[Βαθμολογία],tblClassScores[Μάθημα],Υπολογισμοί!$C8,tblClassScores[Τύπος],Υπολογισμοί!AI$5)*Ρυθμίσεις!K11,\"\")","v":""},0.08000000000000002,{"$f":"SUMIFS(Ρυθμίσεις!E11:K11,Υπολογισμοί!AC8:AI8,\">0\")","v":0.1},{"v":0.8000000000000002,"d":"80%"},2.67,"B-"]
[null,null,"Μαθηματικά 2",{"v":0.85,"d":"85%"},{"v":0.95,"d":"95%"},"","","","","","","","","","","","","","","","","","","","","","","",{"$f":"IFERROR(AVERAGEIFS(tblClassScores[Βαθμολογία],tblClassScores[Μάθημα],Υπολογισμοί!$C9,tblClassScores[Τύπος],Υπολογισμοί!AC$5)*Ρυθμίσεις!E12,\"\")","v":0.1275},{"$f":"IFERROR(AVERAGEIFS(tblClassScores[Βαθμολογία],tblClassScores[Μάθημα],Υπολογισμοί!$C9,tblClassScores[Τύπος],Υπολογισμοί!AD$5)*Ρυθμίσεις!F12,\"\")","v":""},{"$f":"IFERROR(AVERAGEIFS(tblClassScores[Βαθμολογία],tblClassScores[Μάθημα],Υπολογισμοί!$C9,tblClassScores[Τύπος],Υπολογισμοί!AE$5)*Ρυθμίσεις!G12,\"\")","v":0.095},{"$f":"IFERROR(AVERAGEIFS(tblClassScores[Βαθμολογία],tblClassScores[Μάθημα],Υπολογισμοί!$C9,tblClassScores[Τύπος],Υπολογισμοί!AF$5)*Ρυθμίσεις!H12,\"\")","v":""},{"$f":"IFERROR(AVERAGEIFS(tblClassScores[Βαθμολογία],tblClassScores[Μάθημα],Υπολογισμοί!$C9,tblClassScores[Τύπος],Υπολογισμοί!AG$5)*Ρυθμίσεις!I12,\"\")","v":""},{"$f":"IFERROR(AVERAGEIFS(tblClassScores[Βαθμολογία],tblClassScores[Μάθημα],Υπολογισμοί!$C9,tblClassScores[Τύπος],Υπολογισμοί!AH$5)*Ρυθμίσεις!J12,\"\")","v":""},{"$f":"IFERROR(AVERAGEIFS(tblClassScores[Βαθμολογία],tblClassScores[Μάθημα],Υπολογισμοί!$C9,tblClassScores[Τύπος],Υπολογισμοί!AI$5)*Ρυθμίσεις!K12,\"\")","v":""},0.2225,{"$f":"SUMIFS(Ρυθμίσεις!E12:K12,Υπολογισμοί!AC9:AI9,\">0\")","v":0.25},{"v":0.89,"d":"89%"},3.33,"B+"]
[null,null,"Προχωρημένος προγραμματισμός σε Java",{"v":0.75,"d":"75%"},"","","","","","","","","","","","","","","","","","","","","","","","",{"$f":"IFERROR(AVERAGEIFS(tblClassScores[Βαθμολογία],tblClassScores[Μάθημα],Υπολογισμοί!$C10,tblClassScores[Τύπος],Υπολογισμοί!AC$5)*Ρυθμίσεις!E13,\"\")","v":""},{"$f":"IFERROR(AVERAGEIFS(tblClassScores[Βαθμολογία],tblClassScores[Μάθημα],Υπολογισμοί!$C10,tblClassScores[Τύπος],Υπολογισμοί!AD$5)*Ρυθμίσεις!F13,\"\")","v":""},{"$f":"IFERROR(AVERAGEIFS(tblClassScores[Βαθμολογία],tblClassScores[Μάθημα],Υπολογισμοί!$C10,tblClassScores[Τύπος],Υπολογισμοί!AE$5)*Ρυθμίσεις!G13,\"\")","v":""},{"$f":"IFERROR(AVERAGEIFS(tblClassScores[Βαθμολογία],tblClassScores[Μάθημα],Υπολογισμοί!$C10,tblClassScores[Τύπος],Υπολογισμοί!AF$5)*Ρυθμίσεις!H13,\"\")","v":""},{"$f":"IFERROR(AVERAGEIFS(tblClassScores[Βαθμολογία],tblClassScores[Μάθημα],Υπολογισμοί!$C10,tblClassScores[Τύπος],Υπολογισμοί!AG$5)*Ρυθμίσεις!I13,\"\")","v":0.15000000000000002},{"$f":"IFERROR(AVERAGEIFS(tblClassScores[Βαθμολογία],tblClassScores[Μάθημα],Υπολογισμοί!$C10,tblClassScores[Τύπος],Υπολογισμοί!AH$5)*Ρυθμίσεις!J13,\"\")","v":""},{"$f":"IFERROR(AVERAGEIFS(tblClassScores[Βαθμολογία],tblClassScores[Μάθημα],Υπολογισμοί!$C10,tblClassScores[Τύπος],Υπολογισμοί!AI$5)*Ρυθμίσεις!K13,\"\")","v":""},0.15000000000000002,{"$f":"SUMIFS(Ρυθμίσεις!E13:K13,Υπολογισμοί!AC10:AI10,\">0\")","v":0.2},{"v":0.7500000000000001,"d":"75%"},2,"C"]
[null,null,"Ισπανικά",{"v":0.5,"d":"50%"},"","","","","","","","","","","","","","","","","","","","","","","","",{"$f":"IFERROR(AVERAGEIFS(tblClassScores[Βαθμολογία],tblClassScores[Μάθημα],Υπολογισμοί!$C11,tblClassScores[Τύπος],Υπολογισμοί!AC$5)*Ρυθμίσεις!E14,\"\")","v":0.05},{"$f":"IFERROR(AVERAGEIFS(tblClassScores[Βαθμολογία],tblClassScores[Μάθημα],Υπολογισμοί!$C11,tblClassScores[Τύπος],Υπολογισμοί!AD$5)*Ρυθμίσεις!F14,\"\")","v":""},{"$f":"IFERROR(AVERAGEIFS(tblClassScores[Βαθμολογία],tblClassScores[Μάθημα],Υπολογισμοί!$C11,tblClassScores[Τύπος],Υπολογισμοί!AE$5)*Ρυθμίσεις!G14,\"\")","v":""},{"$f":"IFERROR(AVERAGEIFS(tblClassScores[Βαθμολογία],tblClassScores[Μάθημα],Υπολογισμοί!$C11,tblClassScores[Τύπος],Υπολογισμοί!AF$5)*Ρυθμίσεις!H14,\"\")","v":""},{"$f":"IFERROR(AVERAGEIFS(tblClassScores[Βαθμολογία],tblClassScores[Μάθημα],Υπολογισμοί!$C11,tblClassScores[Τύπος],Υπολογισμοί!AG$5)*Ρυθμίσεις!I14,\"\")","v":""},{"$f":"IFERROR(AVERAGEIFS(tblClassScores[Βαθμολογία],tblClassScores[Μάθημα],Υπολογισμοί!$C11,tblClassScores[Τύπος],Υπολογισμοί!AH$5)*Ρυθμίσεις!J14,\"\")","v":""},{"$f":"IFERROR(AVERAGEIFS(tblClassScores[Βαθμολογία],tblClassScores[Μάθημα],Υπολογισμοί!$C11,tblClassScores[Τύπος],Υπολογισμοί!AI$5)*Ρυθμίσεις!K14,\"\")","v":""},0.05,{"$f":"SUMIFS(Ρυθμίσεις!E14:K14,Υπολογισμοί!AC11:AI11,\">0\")","v":0.1},{"v":0.5,"d":"50%"},0,"F"]
[null,null,"Έκθεση",{"v":0.95,"d":"95%"},"","","","","","","","","","","","","","","","","","","","","","","","",{"$f":"IFERROR(AVERAGEIFS(tblClassScores[Βαθμολογία],tblClassScores[Μάθημα],Υπολογισμοί!$C12,tblClassScores[Τύπος],Υπολογισμοί!AC$5)*Ρυθμίσεις!E15,\"\")","v":""},{"$f":"IFERROR(AVERAGEIFS(tblClassScores[Βαθμολογία],tblClassScores[Μάθημα],Υπολογισμοί!$C12,tblClassScores[Τύπος],Υπολογισμοί!AD$5)*Ρυθμίσεις!F15,\"\")","v":""},{"$f":"IFERROR(AVERAGEIFS(tblClassScores[Βαθμολογία],tblClassScores[Μάθημα],Υπολογισμοί!$C12,tblClassScores[Τύπος],Υπολογισμοί!AE$5)*Ρυθμίσεις!G15,\"\")","v":""},{"$f":"IFERROR(AVERAGEIFS(tblClassScores[Βαθμολογία],tblClassScores[Μάθημα],Υπολογισμοί!$C12,tblClassScores[Τύπος],Υπολογισμοί!AF$5)*Ρυθμίσεις!H15,\"\")","v":0.1425},{"$f":"IFERROR(AVERAGEIFS(tblClassScores[Βαθμολογία],tblClassScores[Μάθημα],Υπολογισμοί!$C12,tblClassScores[Τύπος],Υπολογισμοί!AG$5)*Ρυθμίσεις!I15,\"\")","v":""},{"$f":"IFERROR(AVERAGEIFS(tblClassScores[Βαθμολογία],tblClassScores[Μάθημα],Υπολογισμοί!$C12,tblClassScores[Τύπος],Υπολογισμοί!AH$5)*Ρυθμίσεις!J15,\"\")","v":""},{"$f":"IFERROR(AVERAGEIFS(tblClassScores[Βαθμολογία],tblClassScores[Μάθημα],Υπολογισμοί!$C12,tblClassScores[Τύπος],Υπολογισμοί!AI$5)*Ρυθμίσεις!K15,\"\")","v":""},0.1425,{"$f":"SUMIFS(Ρυθμίσεις!E15:K15,Υπολογισμοί!AC12:AI12,\">0\")","v":0.15},{"v":0.95,"d":"95%"},4,"A"]
[null,null,{"$f":"IF(Ρυθμίσεις!C16=\"\",\"\",Ρυθμίσεις!C16)","v":""},"","","","","","","","","","","","","","","","","","","","","","","","","",{"$f":"IFERROR(AVERAGEIFS(tblClassScores[Βαθμολογία],tblClassScores[Μάθημα],Υπολογισμοί!$C13,tblClassScores[Τύπος],Υπολογισμοί!AC$5)*Ρυθμίσεις!#REF!,\"\")","v":""},{"$f":"IFERROR(AVERAGEIFS(tblClassScores[Βαθμολογία],tblClassScores[Μάθημα],Υπολογισμοί!$C13,tblClassScores[Τύπος],Υπολογισμοί!AD$5)*Ρυθμίσεις!#REF!,\"\")","v":""},{"$f":"IFERROR(AVERAGEIFS(tblClassScores[Βαθμολογία],tblClassScores[Μάθημα],Υπολογισμοί!$C13,tblClassScores[Τύπος],Υπολογισμοί!AE$5)*Ρυθμίσεις!#REF!,\"\")","v":""},{"$f":"IFERROR(AVERAGEIFS(tblClassScores[Βαθμολογία],tblClassScores[Μάθημα],Υπολογισμοί!$C13,tblClassScores[Τύπος],Υπολογισμοί!AF$5)*Ρυθμίσεις!#REF!,\"\")","v":""},{"$f":"IFERROR(AVERAGEIFS(tblClassScores[Βαθμολογία],tblClassScores[Μάθημα],Υπολογισμοί!$C13,tblClassScores[Τύπος],Υπολογισμοί!AG$5)*Ρυθμίσεις!#REF!,\"\")","v":""},{"$f":"IFERROR(AVERAGEIFS(tblClassScores[Βαθμολογία],tblClassScores[Μάθημα],Υπολογισμοί!$C13,tblClassScores[Τύπος],Υπολογισμοί!AH$5)*Ρυθμίσεις!#REF!,\"\")","v":""},{"$f":"IFERROR(AVERAGEIFS(tblClassScores[Βαθμολογία],tblClassScores[Μάθημα],Υπολογισμοί!$C13,tblClassScores[Τύπος],Υπολογισμοί!AI$5)*Ρυθμίσεις!#REF!,\"\")","v":""},0,{"$f":"SUMIFS(Ρυθμίσεις!E16:K16,Υπολογισμοί!AC13:AI13,\">0\")","v":0},"","",""]
[null,null,{"$f":"IF(Ρυθμίσεις!C17=\"\",\"\",Ρυθμίσεις!C17)","v":""},"","","","","","","","","","","","","","","","","","","","","","","","","",{"$f":"IFERROR(AVERAGEIFS(tblClassScores[Βαθμολογία],tblClassScores[Μάθημα],Υπολογισμοί!$C14,tblClassScores[Τύπος],Υπολογισμοί!AC$5)*Ρυθμίσεις!#REF!,\"\")","v":""},{"$f":"IFERROR(AVERAGEIFS(tblClassScores[Βαθμολογία],tblClassScores[Μάθημα],Υπολογισμοί!$C14,tblClassScores[Τύπος],Υπολογισμοί!AD$5)*Ρυθμίσεις!#REF!,\"\")","v":""},{"$f":"IFERROR(AVERAGEIFS(tblClassScores[Βαθμολογία],tblClassScores[Μάθημα],Υπολογισμοί!$C14,tblClassScores[Τύπος],Υπολογισμοί!AE$5)*Ρυθμίσεις!#REF!,\"\")","v":""},{"$f":"IFERROR(AVERAGEIFS(tblClassScores[Βαθμολογία],tblClassScores[Μάθημα],Υπολογισμοί!$C14,tblClassScores[Τύπος],Υπολογισμοί!AF$5)*Ρυθμίσεις!#REF!,\"\")","v":""},{"$f":"IFERROR(AVERAGEIFS(tblClassScores[Βαθμολογία],tblClassScores[Μάθημα],Υπολογισμοί!$C14,tblClassScores[Τύπος],Υπολογισμοί!AG$5)*Ρυθμίσεις!#REF!,\"\")","v":""},{"$f":"IFERROR(AVERAGEIFS(tblClassScores[Βαθμολογία],tblClassScores[Μάθημα],Υπολογισμοί!$C14,tblClassScores[Τύπος],Υπολογισμοί!AH$5)*Ρυθμίσεις!#REF!,\"\")","v":""},{"$f":"IFERROR(AVERAGEIFS(tblClassScores[Βαθμολογία],tblClassScores[Μάθημα],Υπολογισμοί!$C14,tblClassScores[Τύπος],Υπολογισμοί!AI$5)*Ρυθμίσεις!#REF!,\"\")","v":""},0,{"$f":"SUMIFS(Ρυθμίσεις!E17:K17,Υπολογισμοί!AC14:AI14,\">0\")","v":0},"","",""]
[null,null,{"$f":"IF(Ρυθμίσεις!C18=\"\",\"\",Ρυθμίσεις!C18)","v":""},"","","","","","","","","","","","","","","","","","","","","","","","","",{"$f":"IFERROR(AVERAGEIFS(tblClassScores[Βαθμολογία],tblClassScores[Μάθημα],Υπολογισμοί!$C15,tblClassScores[Τύπος],Υπολογισμοί!AC$5)*Ρυθμίσεις!#REF!,\"\")","v":""},{"$f":"IFERROR(AVERAGEIFS(tblClassScores[Βαθμολογία],tblClassScores[Μάθημα],Υπολογισμοί!$C15,tblClassScores[Τύπος],Υπολογισμοί!AD$5)*Ρυθμίσεις!#REF!,\"\")","v":""},{"$f":"IFERROR(AVERAGEIFS(tblClassScores[Βαθμολογία],tblClassScores[Μάθημα],Υπολογισμοί!$C15,tblClassScores[Τύπος],Υπολογισμοί!AE$5)*Ρυθμίσεις!#REF!,\"\")","v":""},{"$f":"IFERROR(AVERAGEIFS(tblClassScores[Βαθμολογία],tblClassScores[Μάθημα],Υπολογισμοί!$C15,tblClassScores[Τύπος],Υπολογισμοί!AF$5)*Ρυθμίσεις!#REF!,\"\")","v":""},{"$f":"IFERROR(AVERAGEIFS(tblClassScores[Βαθμολογία],tblClassScores[Μάθημα],Υπολογισμοί!$C15,tblClassScores[Τύπος],Υπολογισμοί!AG$5)*Ρυθμίσεις!#REF!,\"\")","v":""},{"$f":"IFERROR(AVERAGEIFS(tblClassScores[Βαθμολογία],tblClassScores[Μάθημα],Υπολογισμοί!$C15,tblClassScores[Τύπος],Υπολογισμοί!AH$5)*Ρυθμίσεις!#REF!,\"\")","v":""},{"$f":"IFERROR(AVERAGEIFS(tblClassScores[Βαθμολογία],tblClassScores[Μάθημα],Υπολογισμοί!$C15,tblClassScores[Τύπος],Υπολογισμοί!AI$5)*Ρυθμίσεις!#REF!,\"\")","v":""},0,{"$f":"SUMIFS(Ρυθμίσεις!E18:K18,Υπολογισμοί!AC15:AI15,\">0\")","v":0},"","",""]
{"$rows_left_out":642}