{"text_format":"3","workbook":"xlsx","n_sheets":2,"sheets":["Κατανομή χρόνου υπαλλήλου","Αναζήτηση εργάσιμης ημέρας"],"not_rendered":{"defined_names":27},"read":"whole","date_system":"1900"}

{"sheet":"Κατανομή χρόνου υπαλλήλου","index":0,"n_rows":36,"n_cols":26,"rows_kept":36,"merged":[[0,1,2,4],[0,5,2,9],[0,10,2,14],[0,15,3,23],[0,24,3,24],[3,1,3,3],[3,5,3,9],[3,10,3,14],[4,1,6,3],[4,4,6,6],[5,14,7,14],[5,22,7,22],[5,23,7,23],[5,24,7,24],[21,1,21,6],[22,1,23,3],[22,4,23,6],[23,14,24,14],[23,22,24,22],[23,23,24,23],[23,24,24,24],[32,1,32,6],[32,24,33,24],[32,25,33,25],[33,1,33,6],[34,1,34,6],[35,1,35,3],[35,4,35,5],[35,6,35,7],[35,8,35,14],[35,15,35,16],[35,17,35,23]]}
[null,"ΦΥΛΛΟ ΚΑΤΑΝΟΜΗΣ ΧΡΟΝΟΥ ΥΠΑΛΛΗΛΟΥ ΛΕΙΤΟΥΡΓΙΩΝ",{"$nulls":3},"Όνομα υπαλλήλου",{"$nulls":9},"Επιλέξτε \"Ναι\" στο κελί στα δεξιά εάν απαιτείται \nέγκριση υπερωριών"]
[]
[]
[null,"Ημερομηνία τέλους μισθοδοσίας",null,null,{"$f":"V7","v":"2025-06-14"},"Αριθμός υπαλλήλου"]
[null,"ΚΑΝΟΝΙΚΕΣ ΩΡΕΣ:",null,null,"Ημερομηνία:"]
[{"$nulls":14},"Σύνολο\nκανονικών ωρών\nεβδομάδας 1",{"$nulls":7},"Σύνολο\nκανονικών ωρών\nεβδομάδας 2","Σύνολο\nκανονικών\nωρών","Κωδικός πληρωμής\nγια χρήση μόνο από\nτη μισθοδοσία"]
[{"$nulls":7},"2025-06-01",{"$f":"Ημέρα_Πρώτη+1","v":"2025-06-02"},{"$f":"Ημέρα_Πρώτη+2","v":"2025-06-03"},{"$f":"Ημέρα_Πρώτη+3","v":"2025-06-04"},{"$f":"Ημέρα_Πρώτη+4","v":"2025-06-05"},{"$f":"Ημέρα_Πρώτη+5","v":"2025-06-06"},{"$f":"Ημέρα_Πρώτη+6","v":"2025-06-07"},null,{"$f":"Ημέρα_Πρώτη+7","v":"2025-06-08"},{"$f":"Ημέρα_Πρώτη+8","v":"2025-06-09"},{"$f":"Ημέρα_Πρώτη+9","v":"2025-06-10"},{"$f":"Ημέρα_Πρώτη+10","v":"2025-06-11"},{"$f":"Ημέρα_Πρώτη+11","v":"2025-06-12"},{"$f":"Ημέρα_Πρώτη+12","v":"2025-06-13"},{"$f":"Ημέρα_Πρώτη+13","v":"2025-06-14"}]
[null,"Εργασία","Θέση","Αρ. παραγγελίας εργασίας","Περιγραφή εργασίας","Θέση εργασίας","Αρ. τίτλου",{"$f":"VLOOKUP(WEEKDAY(Ημέρα_Πρώτη),'Αναζήτηση εργάσιμης ημέρας'!$B$2:$C$8,2)","v":"Κυρ"},{"$f":"VLOOKUP(WEEKDAY(I7),'Αναζήτηση εργάσιμης ημέρας'!$B$2:$C$8,2)","v":"Δευ"},{"$f":"VLOOKUP(WEEKDAY(J7),'Αναζήτηση εργάσιμης ημέρας'!$B$2:$C$8,2)","v":"Τρί"},{"$f":"VLOOKUP(WEEKDAY(K7),'Αναζήτηση εργάσιμης ημέρας'!$B$2:$C$8,2)","v":"Τετ"},{"$f":"VLOOKUP(WEEKDAY(L7),'Αναζήτηση εργάσιμης ημέρας'!$B$2:$C$8,2)","v":"Πέμ"},{"$f":"VLOOKUP(WEEKDAY(M7),'Αναζήτηση εργάσιμης ημέρας'!$B$2:$C$8,2)","v":"Παρ"},{"$f":"VLOOKUP(WEEKDAY(N7),'Αναζήτηση εργάσιμης ημέρας'!$B$2:$C$8,2)","v":"Σάβ"},null,{"$f":"VLOOKUP(WEEKDAY(P7),'Αναζήτηση εργάσιμης ημέρας'!$B$2:$C$8,2)","v":"Κυρ"},{"$f":"VLOOKUP(WEEKDAY(Q7),'Αναζήτηση εργάσιμης ημέρας'!$B$2:$C$8,2)","v":"Δευ"},{"$f":"VLOOKUP(WEEKDAY(R7),'Αναζήτηση εργάσιμης ημέρας'!$B$2:$C$8,2)","v":"Τρί"},{"$f":"VLOOKUP(WEEKDAY(S7),'Αναζήτηση εργάσιμης ημέρας'!$B$2:$C$8,2)","v":"Τετ"},{"$f":"VLOOKUP(WEEKDAY(T7),'Αναζήτηση εργάσιμης ημέρας'!$B$2:$C$8,2)","v":"Πέμ"},{"$f":"VLOOKUP(WEEKDAY(U7),'Αναζήτηση εργάσιμης ημέρας'!$B$2:$C$8,2)","v":"Παρ"},{"$f":"VLOOKUP(WEEKDAY(V7),'Αναζήτηση εργάσιμης ημέρας'!$B$2:$C$8,2)","v":"Σάβ"}]
[{"$nulls":14},{"$f":"SUM(H9:N9)","v":{"v":0,"d":"0.00"}},{"$nulls":7},{"$f":"SUM(P9:V9)","v":{"v":0,"d":"0.00"}},{"$f":"O9+W9","v":{"v":0,"d":"0.00"}}]
[{"$nulls":14},{"v":0,"d":"0.00"},{"$nulls":7},{"v":0,"d":"0.00"},{"v":0,"d":"0.00"}]
[{"$nulls":14},{"v":0,"d":"0.00"},{"$nulls":7},{"v":0,"d":"0.00"},{"v":0,"d":"0.00"}]
[{"$nulls":14},{"v":0,"d":"0.00"},{"$nulls":7},{"v":0,"d":"0.00"},{"v":0,"d":"0.00"}]
[{"$nulls":14},{"v":0,"d":"0.00"},{"$nulls":7},{"v":0,"d":"0.00"},{"v":0,"d":"0.00"}]
[{"$nulls":14},{"v":0,"d":"0.00"},{"$nulls":7},{"v":0,"d":"0.00"},{"v":0,"d":"0.00"}]
[{"$nulls":14},{"v":0,"d":"0.00"},{"$nulls":7},{"v":0,"d":"0.00"},{"v":0,"d":"0.00"}]
[{"$nulls":14},{"$f":"SUM(H16:N16)","v":{"v":0,"d":"0.00"}},{"$nulls":7},{"$f":"SUM(P16:V16)","v":{"v":0,"d":"0.00"}},{"$f":"O16+W16","v":{"v":0,"d":"0.00"}}]
[{"$nulls":14},{"v":0,"d":"0.00"},{"$nulls":7},{"v":0,"d":"0.00"},{"v":0,"d":"0.00"}]
[{"$nulls":14},{"v":0,"d":"0.00"},{"$nulls":7},{"v":0,"d":"0.00"},{"v":0,"d":"0.00"}]
[{"$nulls":14},{"v":0,"d":"0.00"},{"$nulls":7},{"v":0,"d":"0.00"},{"v":0,"d":"0.00"}]
[{"$nulls":14},{"v":0,"d":"0.00"},{"$nulls":7},{"v":0,"d":"0.00"},{"v":0,"d":"0.00"}]
[{"$nulls":14},{"v":0,"d":"0.00"},{"$nulls":7},{"v":0,"d":"0.00"},{"v":0,"d":"0.00"}]
[null,"Σύνολο κανονικών ωρών   ",{"$nulls":5},{"$f":"SUM(H9:H21)","v":{"v":0,"d":"0.00"}},{"v":0,"d":"0.00"},{"v":0,"d":"0.00"},{"v":0,"d":"0.00"},{"v":0,"d":"0.00"},{"v":0,"d":"0.00"},{"v":0,"d":"0.00"},{"v":0,"d":"0.00"},{"v":0,"d":"0.00"},{"$f":"SUM(Q9:Q21)","v":{"v":0,"d":"0.00"}},{"v":0,"d":"0.00"},{"v":0,"d":"0.00"},{"v":0,"d":"0.00"},{"v":0,"d":"0.00"},{"v":0,"d":"0.00"},{"$f":"SUM(W9:W21)","v":{"v":0,"d":"0.00"}},{"$f":"SUM(X9:X21)","v":{"v":0,"d":"0.00"}}]
[null,"ΩΡΕΣ ΥΠΕΡΩΡΙΩΝ:",null,null,"Ημερομηνία:"]
[{"$nulls":7},{"$f":"Ημέρα_Πρώτη","v":"2025-06-01"},{"$f":"Ημέρα_Πρώτη+1","v":"2025-06-02"},{"$f":"Ημέρα_Πρώτη+2","v":"2025-06-03"},{"$f":"Ημέρα_Πρώτη+3","v":"2025-06-04"},{"$f":"Ημέρα_Πρώτη+4","v":"2025-06-05"},{"$f":"Ημέρα_Πρώτη+5","v":"2025-06-06"},{"$f":"Ημέρα_Πρώτη+6","v":"2025-06-07"},"Υπερωρίες εβδομάδας 1",{"$f":"Ημέρα_Πρώτη+7","v":"2025-06-08"},{"$f":"Ημέρα_Πρώτη+8","v":"2025-06-09"},{"$f":"Ημέρα_Πρώτη+9","v":"2025-06-10"},{"$f":"Ημέρα_Πρώτη+10","v":"2025-06-11"},{"$f":"Ημέρα_Πρώτη+11","v":"2025-06-12"},{"$f":"Ημέρα_Πρώτη+12","v":"2025-06-13"},{"$f":"Ημέρα_Πρώτη+13","v":"2025-06-14"},"Υπερωρίες εβδομάδας 2","Σύνολο υπερωριών","Κώδικας\nυπερωριών"]
[null,"Εργασία","Θέση","Αρ. παραγγελίας εργασίας","Περιγραφή εργασίας","Θέση εργασίας","Αρ. τίτλου",{"$f":"VLOOKUP(WEEKDAY(Ημέρα_Πρώτη),'Αναζήτηση εργάσιμης ημέρας'!$B$2:$C$8,2)","v":"Κυρ"},{"$f":"VLOOKUP(WEEKDAY(I24),'Αναζήτηση εργάσιμης ημέρας'!$B$2:$C$8,2)","v":"Δευ"},{"$f":"VLOOKUP(WEEKDAY(J24),'Αναζήτηση εργάσιμης ημέρας'!$B$2:$C$8,2)","v":"Τρί"},{"$f":"VLOOKUP(WEEKDAY(K24),'Αναζήτηση εργάσιμης ημέρας'!$B$2:$C$8,2)","v":"Τετ"},{"$f":"VLOOKUP(WEEKDAY(L24),'Αναζήτηση εργάσιμης ημέρας'!$B$2:$C$8,2)","v":"Πέμ"},{"$f":"VLOOKUP(WEEKDAY(M24),'Αναζήτηση εργάσιμης ημέρας'!$B$2:$C$8,2)","v":"Παρ"},{"$f":"VLOOKUP(WEEKDAY(N24),'Αναζήτηση εργάσιμης ημέρας'!$B$2:$C$8,2)","v":"Σάβ"},null,{"$f":"VLOOKUP(WEEKDAY(P24),'Αναζήτηση εργάσιμης ημέρας'!$B$2:$C$8,2)","v":"Κυρ"},{"$f":"VLOOKUP(WEEKDAY(Q24),'Αναζήτηση εργάσιμης ημέρας'!$B$2:$C$8,2)","v":"Δευ"},{"$f":"VLOOKUP(WEEKDAY(R24),'Αναζήτηση εργάσιμης ημέρας'!$B$2:$C$8,2)","v":"Τρί"},{"$f":"VLOOKUP(WEEKDAY(S24),'Αναζήτηση εργάσιμης ημέρας'!$B$2:$C$8,2)","v":"Τετ"},{"$f":"VLOOKUP(WEEKDAY(T24),'Αναζήτηση εργάσιμης ημέρας'!$B$2:$C$8,2)","v":"Πέμ"},{"$f":"VLOOKUP(WEEKDAY(U24),'Αναζήτηση εργάσιμης ημέρας'!$B$2:$C$8,2)","v":"Παρ"},{"$f":"VLOOKUP(WEEKDAY(V24),'Αναζήτηση εργάσιμης ημέρας'!$B$2:$C$8,2)","v":"Σάβ"}]
[{"$nulls":14},{"$f":"SUM(H26:N26)","v":{"v":0,"d":"0.00"}},{"$nulls":7},{"$f":"SUM(P26:V26)","v":{"v":0,"d":"0.00"}},{"$f":"O26+W26","v":{"v":0,"d":"0.00"}}]
[{"$nulls":14},{"v":0,"d":"0.00"},{"$nulls":7},{"v":0,"d":"0.00"},{"v":0,"d":"0.00"}]
[{"$nulls":14},{"v":0,"d":"0.00"},{"$nulls":7},{"v":0,"d":"0.00"},{"v":0,"d":"0.00"}]
[{"$nulls":14},{"v":0,"d":"0.00"},{"$nulls":7},{"v":0,"d":"0.00"},{"v":0,"d":"0.00"}]
[{"$nulls":14},{"v":0,"d":"0.00"},{"$nulls":7},{"v":0,"d":"0.00"},{"v":0,"d":"0.00"}]
[{"$nulls":14},{"v":0,"d":"0.00"},{"$nulls":7},{"v":0,"d":"0.00"},{"v":0,"d":"0.00"}]
[{"$nulls":14},{"v":0,"d":"0.00"},{"$nulls":7},{"v":0,"d":"0.00"},{"v":0,"d":"0.00"}]
[null,"Σύνολο ωρών υπερωριών     ",{"$nulls":5},{"$f":"SUM(H26:H32)","v":{"v":0,"d":"0.00"}},{"v":0,"d":"0.00"},{"v":0,"d":"0.00"},{"v":0,"d":"0.00"},{"v":0,"d":"0.00"},{"v":0,"d":"0.00"},{"v":0,"d":"0.00"},{"$f":"SUM(O26:O32)","v":{"v":0,"d":"0.00"}},{"v":0,"d":"0.00"},{"v":0,"d":"0.00"},{"v":0,"d":"0.00"},{"v":0,"d":"0.00"},{"v":0,"d":"0.00"},{"v":0,"d":"0.00"},{"v":0,"d":"0.00"},{"$f":"SUM(P33:V33)","v":{"v":0,"d":"0.00"}},{"$f":"SUM(X26:X32)","v":{"v":0,"d":"0.00"}},"Σύνολο\nωρών\nεργασίας","Σύνολο\nωρών\nγια πληρωμή"]
[null,"Αποζημίωση υπερωριών     ",{"$nulls":12},{"$f":"IF(SUM(H34:N34)<=O33,SUM(H34:N34),O33)","v":{"v":0,"d":"0.00"}},{"$nulls":7},{"$f":"IF(SUM(P34:V34)<=W33,SUM(P34:V34),W33)","v":{"v":0,"d":"0.00"}},{"$f":"IF(SUM(Q34:W34)<=X33,SUM(Q34:W34),X33)","v":{"v":0,"d":"0.00"}}]
[null,"Υπερωρίες για πληρωμή     ",{"$nulls":5},{"$f":"IF(H33>=H34,H33-H34,H33)","v":{"v":0,"d":"0.00"}},{"$f":"IF(I33>=I34,I33-I34,I33)","v":{"v":0,"d":"0.00"}},{"v":0,"d":"0.00"},{"v":0,"d":"0.00"},{"v":0,"d":"0.00"},{"v":0,"d":"0.00"},{"v":0,"d":"0.00"},{"v":0,"d":"0.00"},{"v":0,"d":"0.00"},{"v":0,"d":"0.00"},{"v":0,"d":"0.00"},{"v":0,"d":"0.00"},{"v":0,"d":"0.00"},{"v":0,"d":"0.00"},{"v":0,"d":"0.00"},{"$f":"IF(W33>=W34,W33-W34,W33)","v":{"v":0,"d":"0.00"}},{"$f":"IF(X33>=X34,X33-X34,X33)","v":{"v":0,"d":"0.00"}},{"$f":"$X$22+$X$33","v":{"v":0,"d":"0.00"}},{"$f":"X22+X35","v":{"v":0,"d":"0.00"}}]
[null,"Υπάλληλος ",{"$nulls":4},"Προϊστάμενος ",{"$nulls":8},"Προϊστάμενος "]

{"sheet":"Αναζήτηση εργάσιμης ημέρας","index":1,"n_rows":8,"n_cols":3,"rows_kept":8}
[null,"Ακέραιος\nεργάσιμης ημέρας","Αρχικά\nεργάσιμης ημέρας"]
[null,1,"Κυρ"]
[null,2,"Δευ"]
[null,3,"Τρί"]
[null,4,"Τετ"]
[null,5,"Πέμ"]
[null,6,"Παρ"]
[null,7,"Σάβ"]