{"text_format":"1","workbook":"xlsx","n_sheets":5,"sheets":["Οδηγίες","Βαθμολόγιο","Σύνοψη μαθητή","Κριτήρια βαθμολόγησης","Chart Data"],"not_rendered":{"charts":1,"images":0,"macros":1,"external_links":1,"defined_names":14,"comments":0,"pivot_tables":0},"unopened":[],"bounds":{"document_bytes":16777216,"sheet_cells":100000,"rows_first":2000,"rows_last":500,"rows_between":2000,"halvings":0,"cell_chars":16384,"cell_head_chars":4096},"cells_cut":0,"cells_raw":0,"read":"whole","date_system":"1900"}

{"sheet":"Οδηγίες","index":0,"n_rows":24,"n_cols":3,"rows_kept":24,"cut":false,"hidden":false,"merged":[[3,1,3,11],[22,2,22,11],[21,2,21,11],[23,2,23,11],[5,2,5,11],[8,2,8,11],[10,2,10,11],[12,2,12,12],[6,2,6,10],[20,1,20,11],[13,2,13,5],[15,2,15,12],[16,2,16,12],[17,2,17,12],[18,2,18,12]]}
[null,"Οδηγίες"]
[null,"Βεβαιωθείτε ότι αποθηκεύετε αντίγραφα ασφαλείας των βαθμών σας, σε περίπτωση που συμβεί κάτι."]
[null,"Πώς μπορώ να ξεκινήσω;"]
[null,"Υπάρχουν κάποια βήματα που πρέπει να εκτελέσετε για να εξατομικεύσετε αυτό το πρότυπο προτού να ξεκινήσετε να παρακολουθείτε τους βαθμούς των μαθητών:"]
[null,"ΣΤΟ ΦΥΛΛΟ ΒΑΘΜΟΛΟΓΙΟΥ:"]
[null,"●","Αντικαταστήστε τα σύμβολα κράτησης θέσης Όνομα τάξης και Όνομα εκπαιδευτικού με τα δικά σας στοιχεία.  "]
[null,"●","Προσθέστε κάθε μαθητή στο πεδίο Όνομα μαθητή."]
[null,"ΣΤΟ ΦΥΛΛΟ ΣΥΝΟΨΗΣ ΜΑΘΗΤΗ:"]
[null,"●","Αντικαταστήστε το Όνομα σχολείου με το όνομα του σχολείου σας. "]
[null,"ΣΤΟ ΦΥΛΛΟ ΚΡΙΤΗΡΙΩΝ ΒΑΘΜΟΛΟΓΗΣΗΣ:"]
[null,"●","Προσαρμόστε τον πίνακα ΒΑΘΜΩΝ & GPA ώστε να ταιριάζει με το σύστημα βαθμολόγησής σας."]
[null,"(ΠΡΟΑΙΡΕΤΙΚΑ) ΤΡΟΠΟΠΟΙΗΣΤΕ ΤΑ ΧΡΩΜΑΤΑ ΣΕ ΟΛΟ ΤΟ ΒΙΒΛΙΟ ΕΡΓΑΣΙΑΣ:"]
[null,"●","Στην καρτέλα \"Διάταξη σελίδας\", στην ομάδα \"Θέματα\", κάντε κλικ στην επιλογή \"Χρώματα\" και επιλέξτε ένα άλλο σύνολο χρωμάτων θέματος από τη συλλογή χρωμάτων. "]
[]
[null,"Έκανα τις προσαρμογές μου. Τι πρέπει να κάνω στη συνέχεια;"]
[null,"1.","Στο φύλλο βαθμολογίου, προσθέστε μια νέα ανάθεση εργασίας ή ημερομηνία τεστ ξεκινώντας από το κελί J3. Στη συνέχεια, πληκτρολογήστε τις συνολικές μονάδες για την ανάθεση εργασίας ή το τεστ παρακάτω. Οι πιθανές συνολικές μονάδες θα υπολογιστούν αυτόματα."]
[null,"2.","Πληκτρολογήστε το όνομα της αντίστοιχης ανάθεσης εργασίας ή του τεστ ξεκινώντας από το κελί J5.Οι συνολικές μονάδες που αποκτήθηκαν θα υπολογιστούν αυτόματα. "]
[null,"3.","Συμπληρώστε τις βαθμολογίες για κάθε μαθητή σε κάθε ανάθεση εργασίας ή τεστ. Οι στήλες \"Βαθμός\" και \"Ποσοστό\" (%) υπολογίζονται αυτόματα, αλλά μπορείτε να τις παρακάμψετε αν θέλετε. "]
[null,"4.","Για να υπολογίσετε το Μέσο όρο βαθμολογίας/τους Βαθμούς για την ανάθεση εργασίας ή το τεστ που δημιουργήσατε πρόσφατα, κάντε κλικ στο ανοιχτό μπλε κελί \"Σύνολο\" κάτω από τα δεδομένα που προστέθηκαν πρόσφατα και, στη συνέχεια, από την αναπτυσσόμενη λίστα, επιλέξτε \"Μέσος όρος\"."]
[null,"Πώς μπορώ να προσθέσω περισσότερους μαθητές;"]
[null,"Η λίστα των ονομάτων μαθητών και των βαθμών είναι σε πίνακα του Excel. Για να προσθέσετε επιπλέον μαθητές αφού πληκτρολογήσετε επάνω από το δείγμα δεδομένων, εκτελέστε μια από τις εξής ενέργειες:"]
[null,"● ","Τοποθετήστε το δείκτη κελιού στο τελευταίο κελί επάνω από τη γραμμή \"Σύνολο\", που ονομάζεται Μέσος όρος βαθμολογίας/Βαθμοί, για τον τελευταίο μαθητή και, στη συνέχεια, πατήστε το πλήκτρο Tab."]
[null,"● ","Κάντε δεξί κλικ στον πίνακα και στο αναδυόμενο μενού, τοποθετήστε το δείκτη του ποντικιού στην εντολή \"Εισαγωγή\" και, στη συνέχεια, στο στοιχείο Γραμμές πίνακα επάνω από ή Γραμμές πίνακα κάτω από. "]
[null,"● ","Στην κάτω δεξιά γωνία του πίνακα, τοποθετήστε το ποντίκι στη λαβή αλλαγής μεγέθους του πίνακα και σύρετε προς τα κάτω, για να αυξήσετε τον αριθμό των διαθέσιμων γραμμών πίνακα."]

{"sheet":"Βαθμολόγιο","index":1,"n_rows":10,"n_cols":9,"rows_kept":10,"cut":false,"hidden":false,"merged":[]}
[null,"Εισαγάγετε το όνομα της τάξης"]
[null,"Εισαγάγετε το όνομα του εκπαιδευτικού"]
[null,"ΗΜΕΡΟΜΗΝΙΑ ΑΝΑΘΕΣΗΣ ΕΡΓΑΣΙΑΣ",null,null,null,null,"2012-04-30","2012-05-01","2012-05-05"]
[null,"ΣΥΝΟΛΙΚΕΣ ΠΙΘΑΝΕΣ ΜΟΝΑΔΕΣ",null,null,null,{"$f":"SUM(PossiblePoints[#All])","v":90},20,20,50]
[null,"Όνομα μαθητή   ","Επιδόσεις","Βαθμός ","%","Συνολικές μονάδες που αποκτήθηκαν","Εργασία 1","Εργασία 2","Εργασία 3"]
[null,"Μαθητής 1    ",{"$f":"StudentData[[#This Row],[Συνολικές μονάδες που αποκτήθηκαν]]","v":90},{"$f":"IFERROR(VLOOKUP(StudentData[[#This Row],[%]],GradeTable[],2,TRUE),\"\")","v":"A+"},{"$f":"IFERROR(StudentData[[#This Row],[Συνολικές μονάδες που αποκτήθηκαν]]/TotalPoints,\"\")","v":1},{"$f":"IFERROR(SUM(StudentData[[#This Row],[Εργασία 1]]:OFFSET(F6,,COUNTA(ProgressChartValues))),\"\")","v":90},20,20,50]
[null,"Μαθητής 2",{"$f":"StudentData[[#This Row],[Συνολικές μονάδες που αποκτήθηκαν]]","v":60},{"$f":"IFERROR(VLOOKUP(StudentData[[#This Row],[%]],GradeTable[],2,TRUE),\"\")","v":"D"},{"$f":"IFERROR(StudentData[[#This Row],[Συνολικές μονάδες που αποκτήθηκαν]]/TotalPoints,\"\")","v":0.66666666666666663},{"$f":"IFERROR(SUM(StudentData[[#This Row],[Εργασία 1]]:OFFSET(F7,,COUNTA(ProgressChartValues))),\"\")","v":60},10,10,40]
[null,"Μαθητής 3",{"$f":"StudentData[[#This Row],[Συνολικές μονάδες που αποκτήθηκαν]]","v":75},{"$f":"IFERROR(VLOOKUP(StudentData[[#This Row],[%]],GradeTable[],2,TRUE),\"\")","v":"B"},{"$f":"IFERROR(StudentData[[#This Row],[Συνολικές μονάδες που αποκτήθηκαν]]/TotalPoints,\"\")","v":0.83333333333333337},{"$f":"IFERROR(SUM(StudentData[[#This Row],[Εργασία 1]]:OFFSET(F8,,COUNTA(ProgressChartValues))),\"\")","v":75},20,15,40]
[null,"Melton",{"$f":"StudentData[[#This Row],[Συνολικές μονάδες που αποκτήθηκαν]]","v":80},{"$f":"IFERROR(VLOOKUP(StudentData[[#This Row],[%]],GradeTable[],2,TRUE),\"\")","v":"B+"},{"$f":"IFERROR(StudentData[[#This Row],[Συνολικές μονάδες που αποκτήθηκαν]]/TotalPoints,\"\")","v":0.88888888888888884},{"$f":"IFERROR(SUM(StudentData[[#This Row],[Εργασία 1]]:OFFSET(F9,,COUNTA(ProgressChartValues))),\"\")","v":80},20,20,40]
[null,"Μέσος όρος βαθμολογίας/Βαθμοί     ",null,{"$f":"IFERROR(VLOOKUP(StudentData[[#Totals],[%]],GradeTable[],2,TRUE),\"\")","v":"B"},{"$f":"SUBTOTAL(101,StudentData[%])","v":0.84722222222222221},{"$f":"SUBTOTAL(101,StudentData[Συνολικές μονάδες που αποκτήθηκαν])","v":76.25},{"$f":"SUBTOTAL(101,StudentData[Εργασία 1])","v":17.5},{"$f":"SUBTOTAL(101,StudentData[Εργασία 2])","v":16.25},{"$f":"SUBTOTAL(101,StudentData[Εργασία 3])","v":42.5}]

{"sheet":"Σύνοψη μαθητή","index":2,"n_rows":44,"n_cols":9,"rows_kept":44,"cut":false,"hidden":false,"merged":[[42,6,42,8],[5,8,7,8],[31,1,40,8],[5,3,7,3],[5,4,7,4],[5,5,7,5],[5,6,7,6],[5,7,7,7]]}
[null,"Εισαγάγετε το όνομα του σχολείου"]
[]
[]
[]
[null,"ΕΚΠΑΙΔΕΥΤΙΚΟΣ",{"$f":"IF(TeacherName=\"Εισαγάγετε το όνομα του εκπαιδευτικού\",\"\",TeacherName)","v":""},"Rank","Βαθμός ","Ποσοστό","Μονάδες μαθητή","Πιθανές μονάδες","GPA"]
[null,"ΤΑΞΗ",{"$f":"IF(ClassName=\"Εισαγάγετε το όνομα της τάξης\",\"\",ClassName)","v":""},{"$f":"IFERROR(_xlfn.RANK.EQ(VLOOKUP(C8,StudentData[],5,FALSE),StudentData[Συνολικές μονάδες που αποκτήθηκαν]) & \" Από \"&COUNTA(StudentData[[Όνομα μαθητή   ]]),\"\")","v":"1 Από 4"},{"$f":"IFERROR(VLOOKUP(StudentName,StudentData[],3,FALSE),\"\")","v":"A+"},{"$f":"IFERROR(VLOOKUP(StudentName,StudentData[],4,FALSE),\"\")","v":1},{"$f":"IFERROR(VLOOKUP(StudentName,StudentData[],5,FALSE),\"\")","v":90},{"$f":"TotalPoints","v":90},{"$f":"IFERROR(VLOOKUP(F6,GradeTable[],3,TRUE),\"\")","v":4}]
[null,"ΗΜΕΡΟΜΗΝΙΑ","Εισαγάγετε την ημερομηνία της προόδου"]
[null,"ΜΑΘΗΤΗΣ","Μαθητής 1    "]
[]
[]
[]
[null,"Πρόοδος μαθητή"]
[]
[]
[]
[]
[]
[]
[]
[]
[]
[]
[]
[]
[]
[]
[]
[]
[]
[]
[null,"Σχόλια εκπαιδευτικού"]
[]
[]
[]
[]
[]
[]
[]
[]
[]
[]
[]
[]
[null,"Υπογραφή γονέα (αν χρειάζεται)",null,null,null,null,"Ημερομηνία"]

{"sheet":"Κριτήρια βαθμολόγησης","index":3,"n_rows":19,"n_cols":4,"rows_kept":19,"cut":false,"hidden":false,"merged":[]}
[null,"Υπολογισμός βαθμού αλφαβητικής κλίμακας"]
[null,"Εισαγάγετε τις περιοχές ποσοστών για κάθε βαθμό αλφαβητικής κλίμακας στον παρακάτω πίνακα, για να προσαρμόσετε το πρότυπο στα κριτήρια βαθμολόγησής σας."]
[null,"Πίνακας ΒΑΘΜΩΝ & GPA"]
[null,"(Χρησιμοποιείται για τον υπολογισμό των βαθμών μαθητών στο φύλλο Βαθμολογίου)"]
[null,"ΒΑΘΜΟΛΟΓΙΑ","ΒΑΘΜΟΣ ΑΛΦΑΒΗΤΙΚΗΣ ΚΛΙΜΑΚΑΣ ΠΟΥ ΕΠΙΤΕΥΧΘΗΚΕ","GPA"]
[null,0,"F",0]
[null,0.6,"D-",0.67]
[null,0.63,"D",1]
[null,0.67,"D+",1.33]
[null,0.7,"C-",1.67]
[null,0.73,"C",2]
[null,0.77,"C+",2.33]
[null,0.8,"B-",2.67]
[null,0.83,"B",3]
[null,0.87,"B+",3.33]
[null,0.9,"A-",3.67]
[null,0.93,"A",4]
[null,0.97,"A+",4]
[null,"Η βαθμολογία και το GPA πρέπει να καταχωρηθούν σε αύξουσα σειρά."]

{"sheet":"Chart Data","index":4,"n_rows":6,"n_cols":302,"rows_kept":6,"cut":false,"hidden":true,"merged":[]}
[null,"Chart Data for Student Summary Chart"]
[null,"This sheet should remain hidden. Any modifications made to the data below could result in template errors."]
[]
[null,"Chart Labels",{"$f":"ProgressChartLabels","v":"Εργασία 1"},"Εργασία 2","Εργασία 3",{"$error":"#N/A"},{"$error":"#N/A"},{"$error":"#N/A"},{"$error":"#N/A"},{"$error":"#N/A"},{"$error":"#N/A"},{"$error":"#N/A"},{"$error":"#N/A"},{"$error":"#N/A"},{"$error":"#N/A"},{"$error":"#N/A"},{"$error":"#N/A"},{"$error":"#N/A"},{"$error":"#N/A"},{"$error":"#N/A"},{"$error":"#N/A"},{"$error":"#N/A"},{"$error":"#N/A"},{"$error":"#N/A"},{"$error":"#N/A"},{"$error":"#N/A"},{"$error":"#N/A"},{"$error":"#N/A"},{"$error":"#N/A"},{"$error":"#N/A"},{"$error":"#N/A"},{"$error":"#N/A"},{"$error":"#N/A"},{"$error":"#N/A"},{"$error":"#N/A"},{"$error":"#N/A"},{"$error":"#N/A"},{"$error":"#N/A"},{"$error":"#N/A"},{"$error":"#N/A"},{"$error":"#N/A"},{"$error":"#N/A"},{"$error":"#N/A"},{"$error":"#N/A"},{"$error":"#N/A"},{"$error":"#N/A"},{"$error":"#N/A"},{"$error":"#N/A"},{"$error":"#N/A"},{"$error":"#N/A"},{"$error":"#N/A"},{"$error":"#N/A"},{"$error":"#N/A"},{"$error":"#N/A"},{"$error":"#N/A"},{"$error":"#N/A"},{"$error":"#N/A"},{"$error":"#N/A"},{"$error":"#N/A"},{"$error":"#N/A"},{"$error":"#N/A"},{"$error":"#N/A"},{"$error":"#N/A"},{"$error":"#N/A"},{"$error":"#N/A"},{"$error":"#N/A"},{"$error":"#N/A"},{"$error":"#N/A"},{"$error":"#N/A"},{"$error":"#N/A"},{"$error":"#N/A"},{"$error":"#N/A"},{"$error":"#N/A"},{"$error":"#N/A"},{"$error":"#N/A"},{"$error":"#N/A"},{"$error":"#N/A"},{"$error":"#N/A"},{"$error":"#N/A"},{"$error":"#N/A"},{"$error":"#N/A"},{"$error":"#N/A"},{"$error":"#N/A"},{"$error":"#N/A"},{"$error":"#N/A"},{"$error":"#N/A"},{"$error":"#N/A"},{"$error":"#N/A"},{"$error":"#N/A"},{"$error":"#N/A"},{"$error":"#N/A"},{"$error":"#N/A"},{"$error":"#N/A"},{"$error":"#N/A"},{"$error":"#N/A"},{"$error":"#N/A"},{"$error":"#N/A"},{"$error":"#N/A"},{"$error":"#N/A"},{"$error":"#N/A"},{"$error":"#N/A"},{"$error":"#N/A"},{"$error":"#N/A"},{"$error":"#N/A"},{"$error":"#N/A"},{"$error":"#N/A"},{"$error":"#N/A"},{"$error":"#N/A"},{"$error":"#N/A"},{"$error":"#N/A"},{"$error":"#N/A"},{"$error":"#N/A"},{"$error":"#N/A"},{"$error":"#N/A"},{"$error":"#N/A"},{"$error":"#N/A"},{"$error":"#N/A"},{"$error":"#N/A"},{"$error":"#N/A"},{"$error":"#N/A"},{"$error":"#N/A"},{"$error":"#N/A"},{"$error":"#N/A"},{"$error":"#N/A"},{"$error":"#N/A"},{"$error":"#N/A"},{"$error":"#N/A"},{"$error":"#N/A"},{"$error":"#N/A"},{"$error":"#N/A"},{"$error":"#N/A"},{"$error":"#N/A"},{"$error":"#N/A"},{"$error":"#N/A"},{"$error":"#N/A"},{"$error":"#N/A"},{"$error":"#N/A"},{"$error":"#N/A"},{"$error":"#N/A"},{"$error":"#N/A"},{"$error":"#N/A"},{"$error":"#N/A"},{"$error":"#N/A"},{"$error":"#N/A"},{"$error":"#N/A"},{"$error":"#N/A"},{"$error":"#N/A"},{"$error":"#N/A"},{"$error":"#N/A"},{"$error":"#N/A"},{"$error":"#N/A"},{"$error":"#N/A"},{"$error":"#N/A"},{"$error":"#N/A"},{"$error":"#N/A"},{"$error":"#N/A"},{"$error":"#N/A"},{"$error":"#N/A"},{"$error":"#N/A"},{"$error":"#N/A"},{"$error":"#N/A"},{"$error":"#N/A"},{"$error":"#N/A"},{"$error":"#N/A"},{"$error":"#N/A"},{"$error":"#N/A"},{"$error":"#N/A"},{"$error":"#N/A"},{"$error":"#N/A"},{"$error":"#N/A"},{"$error":"#N/A"},{"$error":"#N/A"},{"$error":"#N/A"},{"$error":"#N/A"},{"$error":"#N/A"},{"$error":"#N/A"},{"$error":"#N/A"},{"$error":"#N/A"},{"$error":"#N/A"},{"$error":"#N/A"},{"$error":"#N/A"},{"$error":"#N/A"},{"$error":"#N/A"},{"$error":"#N/A"},{"$error":"#N/A"},{"$error":"#N/A"},{"$error":"#N/A"},{"$error":"#N/A"},{"$error":"#N/A"},{"$error":"#N/A"},{"$error":"#N/A"},{"$error":"#N/A"},{"$error":"#N/A"},{"$error":"#N/A"},{"$error":"#N/A"},{"$error":"#N/A"},{"$error":"#N/A"},{"$error":"#N/A"},{"$error":"#N/A"},{"$error":"#N/A"},{"$error":"#N/A"},{"$error":"#N/A"},{"$error":"#N/A"},{"$error":"#N/A"},{"$error":"#N/A"},{"$error":"#N/A"},{"$error":"#N/A"},{"$error":"#N/A"},{"$error":"#N/A"},{"$error":"#N/A"},{"$error":"#N/A"},{"$error":"#N/A"},{"$error":"#N/A"},{"$error":"#N/A"},{"$error":"#N/A"},{"$error":"#N/A"},{"$error":"#N/A"},{"$error":"#N/A"},{"$error":"#N/A"},{"$error":"#N/A"},{"$error":"#N/A"},{"$error":"#N/A"},{"$error":"#N/A"},{"$error":"#N/A"},{"$error":"#N/A"},{"$error":"#N/A"},{"$error":"#N/A"},{"$error":"#N/A"},{"$error":"#N/A"},{"$error":"#N/A"},{"$error":"#N/A"},{"$error":"#N/A"},{"$error":"#N/A"},{"$error":"#N/A"},{"$error":"#N/A"},{"$error":"#N/A"},{"$error":"#N/A"},{"$error":"#N/A"},{"$error":"#N/A"},{"$error":"#N/A"},{"$error":"#N/A"},{"$error":"#N/A"},{"$error":"#N/A"},{"$error":"#N/A"},{"$error":"#N/A"},{"$error":"#N/A"},{"$error":"#N/A"},{"$error":"#N/A"},{"$error":"#N/A"},{"$error":"#N/A"},{"$error":"#N/A"},{"$error":"#N/A"},{"$error":"#N/A"},{"$error":"#N/A"},{"$error":"#N/A"},{"$error":"#N/A"},{"$error":"#N/A"},{"$error":"#N/A"},{"$error":"#N/A"},{"$error":"#N/A"},{"$error":"#N/A"},{"$error":"#N/A"},{"$error":"#N/A"},{"$error":"#N/A"},{"$error":"#N/A"},{"$error":"#N/A"},{"$error":"#N/A"},{"$error":"#N/A"},{"$error":"#N/A"},{"$error":"#N/A"},{"$error":"#N/A"},{"$error":"#N/A"},{"$error":"#N/A"},{"$error":"#N/A"},{"$error":"#N/A"},{"$error":"#N/A"},{"$error":"#N/A"},{"$error":"#N/A"},{"$error":"#N/A"},{"$error":"#N/A"},{"$error":"#N/A"},{"$error":"#N/A"},{"$error":"#N/A"},{"$error":"#N/A"},{"$error":"#N/A"},{"$error":"#N/A"},{"$error":"#N/A"},{"$error":"#N/A"},{"$error":"#N/A"},{"$error":"#N/A"},{"$error":"#N/A"},{"$error":"#N/A"},{"$error":"#N/A"},{"$error":"#N/A"},{"$error":"#N/A"},{"$error":"#N/A"},{"$error":"#N/A"},{"$error":"#N/A"},{"$error":"#N/A"},{"$error":"#N/A"},{"$error":"#N/A"},{"$error":"#N/A"}]
[null,"Student Points",{"$f":"ProgressChartStudentValues","v":20},20,50,{"$error":"#N/A"},{"$error":"#N/A"},{"$error":"#N/A"},{"$error":"#N/A"},{"$error":"#N/A"},{"$error":"#N/A"},{"$error":"#N/A"},{"$error":"#N/A"},{"$error":"#N/A"},{"$error":"#N/A"},{"$error":"#N/A"},{"$error":"#N/A"},{"$error":"#N/A"},{"$error":"#N/A"},{"$error":"#N/A"},{"$error":"#N/A"},{"$error":"#N/A"},{"$error":"#N/A"},{"$error":"#N/A"},{"$error":"#N/A"},{"$error":"#N/A"},{"$error":"#N/A"},{"$error":"#N/A"},{"$error":"#N/A"},{"$error":"#N/A"},{"$error":"#N/A"},{"$error":"#N/A"},{"$error":"#N/A"},{"$error":"#N/A"},{"$error":"#N/A"},{"$error":"#N/A"},{"$error":"#N/A"},{"$error":"#N/A"},{"$error":"#N/A"},{"$error":"#N/A"},{"$error":"#N/A"},{"$error":"#N/A"},{"$error":"#N/A"},{"$error":"#N/A"},{"$error":"#N/A"},{"$error":"#N/A"},{"$error":"#N/A"},{"$error":"#N/A"},{"$error":"#N/A"},{"$error":"#N/A"},{"$error":"#N/A"},{"$error":"#N/A"},{"$error":"#N/A"},{"$error":"#N/A"},{"$error":"#N/A"},{"$error":"#N/A"},{"$error":"#N/A"},{"$error":"#N/A"},{"$error":"#N/A"},{"$error":"#N/A"},{"$error":"#N/A"},{"$error":"#N/A"},{"$error":"#N/A"},{"$error":"#N/A"},{"$error":"#N/A"},{"$error":"#N/A"},{"$error":"#N/A"},{"$error":"#N/A"},{"$error":"#N/A"},{"$error":"#N/A"},{"$error":"#N/A"},{"$error":"#N/A"},{"$error":"#N/A"},{"$error":"#N/A"},{"$error":"#N/A"},{"$error":"#N/A"},{"$error":"#N/A"},{"$error":"#N/A"},{"$error":"#N/A"},{"$error":"#N/A"},{"$error":"#N/A"},{"$error":"#N/A"},{"$error":"#N/A"},{"$error":"#N/A"},{"$error":"#N/A"},{"$error":"#N/A"},{"$error":"#N/A"},{"$error":"#N/A"},{"$error":"#N/A"},{"$error":"#N/A"},{"$error":"#N/A"},{"$error":"#N/A"},{"$error":"#N/A"},{"$error":"#N/A"},{"$error":"#N/A"},{"$error":"#N/A"},{"$error":"#N/A"},{"$error":"#N/A"},{"$error":"#N/A"},{"$error":"#N/A"},{"$error":"#N/A"},{"$error":"#N/A"},{"$error":"#N/A"},{"$error":"#N/A"},{"$error":"#N/A"},{"$error":"#N/A"},{"$error":"#N/A"},{"$error":"#N/A"},{"$error":"#N/A"},{"$error":"#N/A"},{"$error":"#N/A"},{"$error":"#N/A"},{"$error":"#N/A"},{"$error":"#N/A"},{"$error":"#N/A"},{"$error":"#N/A"},{"$error":"#N/A"},{"$error":"#N/A"},{"$error":"#N/A"},{"$error":"#N/A"},{"$error":"#N/A"},{"$error":"#N/A"},{"$error":"#N/A"},{"$error":"#N/A"},{"$error":"#N/A"},{"$error":"#N/A"},{"$error":"#N/A"},{"$error":"#N/A"},{"$error":"#N/A"},{"$error":"#N/A"},{"$error":"#N/A"},{"$error":"#N/A"},{"$error":"#N/A"},{"$error":"#N/A"},{"$error":"#N/A"},{"$error":"#N/A"},{"$error":"#N/A"},{"$error":"#N/A"},{"$error":"#N/A"},{"$error":"#N/A"},{"$error":"#N/A"},{"$error":"#N/A"},{"$error":"#N/A"},{"$error":"#N/A"},{"$error":"#N/A"},{"$error":"#N/A"},{"$error":"#N/A"},{"$error":"#N/A"},{"$error":"#N/A"},{"$error":"#N/A"},{"$error":"#N/A"},{"$error":"#N/A"},{"$error":"#N/A"},{"$error":"#N/A"},{"$error":"#N/A"},{"$error":"#N/A"},{"$error":"#N/A"},{"$error":"#N/A"},{"$error":"#N/A"},{"$error":"#N/A"},{"$error":"#N/A"},{"$error":"#N/A"},{"$error":"#N/A"},{"$error":"#N/A"},{"$error":"#N/A"},{"$error":"#N/A"},{"$error":"#N/A"},{"$error":"#N/A"},{"$error":"#N/A"},{"$error":"#N/A"},{"$error":"#N/A"},{"$error":"#N/A"},{"$error":"#N/A"},{"$error":"#N/A"},{"$error":"#N/A"},{"$error":"#N/A"},{"$error":"#N/A"},{"$error":"#N/A"},{"$error":"#N/A"},{"$error":"#N/A"},{"$error":"#N/A"},{"$error":"#N/A"},{"$error":"#N/A"},{"$error":"#N/A"},{"$error":"#N/A"},{"$error":"#N/A"},{"$error":"#N/A"},{"$error":"#N/A"},{"$error":"#N/A"},{"$error":"#N/A"},{"$error":"#N/A"},{"$error":"#N/A"},{"$error":"#N/A"},{"$error":"#N/A"},{"$error":"#N/A"},{"$error":"#N/A"},{"$error":"#N/A"},{"$error":"#N/A"},{"$error":"#N/A"},{"$error":"#N/A"},{"$error":"#N/A"},{"$error":"#N/A"},{"$error":"#N/A"},{"$error":"#N/A"},{"$error":"#N/A"},{"$error":"#N/A"},{"$error":"#N/A"},{"$error":"#N/A"},{"$error":"#N/A"},{"$error":"#N/A"},{"$error":"#N/A"},{"$error":"#N/A"},{"$error":"#N/A"},{"$error":"#N/A"},{"$error":"#N/A"},{"$error":"#N/A"},{"$error":"#N/A"},{"$error":"#N/A"},{"$error":"#N/A"},{"$error":"#N/A"},{"$error":"#N/A"},{"$error":"#N/A"},{"$error":"#N/A"},{"$error":"#N/A"},{"$error":"#N/A"},{"$error":"#N/A"},{"$error":"#N/A"},{"$error":"#N/A"},{"$error":"#N/A"},{"$error":"#N/A"},{"$error":"#N/A"},{"$error":"#N/A"},{"$error":"#N/A"},{"$error":"#N/A"},{"$error":"#N/A"},{"$error":"#N/A"},{"$error":"#N/A"},{"$error":"#N/A"},{"$error":"#N/A"},{"$error":"#N/A"},{"$error":"#N/A"},{"$error":"#N/A"},{"$error":"#N/A"},{"$error":"#N/A"},{"$error":"#N/A"},{"$error":"#N/A"},{"$error":"#N/A"},{"$error":"#N/A"},{"$error":"#N/A"},{"$error":"#N/A"},{"$error":"#N/A"},{"$error":"#N/A"},{"$error":"#N/A"},{"$error":"#N/A"},{"$error":"#N/A"},{"$error":"#N/A"},{"$error":"#N/A"},{"$error":"#N/A"},{"$error":"#N/A"},{"$error":"#N/A"},{"$error":"#N/A"},{"$error":"#N/A"},{"$error":"#N/A"},{"$error":"#N/A"},{"$error":"#N/A"},{"$error":"#N/A"},{"$error":"#N/A"},{"$error":"#N/A"},{"$error":"#N/A"},{"$error":"#N/A"},{"$error":"#N/A"},{"$error":"#N/A"},{"$error":"#N/A"},{"$error":"#N/A"},{"$error":"#N/A"},{"$error":"#N/A"},{"$error":"#N/A"},{"$error":"#N/A"},{"$error":"#N/A"},{"$error":"#N/A"},{"$error":"#N/A"},{"$error":"#N/A"},{"$error":"#N/A"},{"$error":"#N/A"},{"$error":"#N/A"},{"$error":"#N/A"},{"$error":"#N/A"},{"$error":"#N/A"},{"$error":"#N/A"},{"$error":"#N/A"},{"$error":"#N/A"},{"$error":"#N/A"},{"$error":"#N/A"},{"$error":"#N/A"},{"$error":"#N/A"},{"$error":"#N/A"},{"$error":"#N/A"},{"$error":"#N/A"},{"$error":"#N/A"},{"$error":"#N/A"},{"$error":"#N/A"},{"$error":"#N/A"}]
[null,"Total Points",{"$f":"ProgressChartValues","v":20},20,50,{"$error":"#N/A"},{"$error":"#N/A"},{"$error":"#N/A"},{"$error":"#N/A"},{"$error":"#N/A"},{"$error":"#N/A"},{"$error":"#N/A"},{"$error":"#N/A"},{"$error":"#N/A"},{"$error":"#N/A"},{"$error":"#N/A"},{"$error":"#N/A"},{"$error":"#N/A"},{"$error":"#N/A"},{"$error":"#N/A"},{"$error":"#N/A"},{"$error":"#N/A"},{"$error":"#N/A"},{"$error":"#N/A"},{"$error":"#N/A"},{"$error":"#N/A"},{"$error":"#N/A"},{"$error":"#N/A"},{"$error":"#N/A"},{"$error":"#N/A"},{"$error":"#N/A"},{"$error":"#N/A"},{"$error":"#N/A"},{"$error":"#N/A"},{"$error":"#N/A"},{"$error":"#N/A"},{"$error":"#N/A"},{"$error":"#N/A"},{"$error":"#N/A"},{"$error":"#N/A"},{"$error":"#N/A"},{"$error":"#N/A"},{"$error":"#N/A"},{"$error":"#N/A"},{"$error":"#N/A"},{"$error":"#N/A"},{"$error":"#N/A"},{"$error":"#N/A"},{"$error":"#N/A"},{"$error":"#N/A"},{"$error":"#N/A"},{"$error":"#N/A"},{"$error":"#N/A"},{"$error":"#N/A"},{"$error":"#N/A"},{"$error":"#N/A"},{"$error":"#N/A"},{"$error":"#N/A"},{"$error":"#N/A"},{"$error":"#N/A"},{"$error":"#N/A"},{"$error":"#N/A"},{"$error":"#N/A"},{"$error":"#N/A"},{"$error":"#N/A"},{"$error":"#N/A"},{"$error":"#N/A"},{"$error":"#N/A"},{"$error":"#N/A"},{"$error":"#N/A"},{"$error":"#N/A"},{"$error":"#N/A"},{"$error":"#N/A"},{"$error":"#N/A"},{"$error":"#N/A"},{"$error":"#N/A"},{"$error":"#N/A"},{"$error":"#N/A"},{"$error":"#N/A"},{"$error":"#N/A"},{"$error":"#N/A"},{"$error":"#N/A"},{"$error":"#N/A"},{"$error":"#N/A"},{"$error":"#N/A"},{"$error":"#N/A"},{"$error":"#N/A"},{"$error":"#N/A"},{"$error":"#N/A"},{"$error":"#N/A"},{"$error":"#N/A"},{"$error":"#N/A"},{"$error":"#N/A"},{"$error":"#N/A"},{"$error":"#N/A"},{"$error":"#N/A"},{"$error":"#N/A"},{"$error":"#N/A"},{"$error":"#N/A"},{"$error":"#N/A"},{"$error":"#N/A"},{"$error":"#N/A"},{"$error":"#N/A"},{"$error":"#N/A"},{"$error":"#N/A"},{"$error":"#N/A"},{"$error":"#N/A"},{"$error":"#N/A"},{"$error":"#N/A"},{"$error":"#N/A"},{"$error":"#N/A"},{"$error":"#N/A"},{"$error":"#N/A"},{"$error":"#N/A"},{"$error":"#N/A"},{"$error":"#N/A"},{"$error":"#N/A"},{"$error":"#N/A"},{"$error":"#N/A"},{"$error":"#N/A"},{"$error":"#N/A"},{"$error":"#N/A"},{"$error":"#N/A"},{"$error":"#N/A"},{"$error":"#N/A"},{"$error":"#N/A"},{"$error":"#N/A"},{"$error":"#N/A"},{"$error":"#N/A"},{"$error":"#N/A"},{"$error":"#N/A"},{"$error":"#N/A"},{"$error":"#N/A"},{"$error":"#N/A"},{"$error":"#N/A"},{"$error":"#N/A"},{"$error":"#N/A"},{"$error":"#N/A"},{"$error":"#N/A"},{"$error":"#N/A"},{"$error":"#N/A"},{"$error":"#N/A"},{"$error":"#N/A"},{"$error":"#N/A"},{"$error":"#N/A"},{"$error":"#N/A"},{"$error":"#N/A"},{"$error":"#N/A"},{"$error":"#N/A"},{"$error":"#N/A"},{"$error":"#N/A"},{"$error":"#N/A"},{"$error":"#N/A"},{"$error":"#N/A"},{"$error":"#N/A"},{"$error":"#N/A"},{"$error":"#N/A"},{"$error":"#N/A"},{"$error":"#N/A"},{"$error":"#N/A"},{"$error":"#N/A"},{"$error":"#N/A"},{"$error":"#N/A"},{"$error":"#N/A"},{"$error":"#N/A"},{"$error":"#N/A"},{"$error":"#N/A"},{"$error":"#N/A"},{"$error":"#N/A"},{"$error":"#N/A"},{"$error":"#N/A"},{"$error":"#N/A"},{"$error":"#N/A"},{"$error":"#N/A"},{"$error":"#N/A"},{"$error":"#N/A"},{"$error":"#N/A"},{"$error":"#N/A"},{"$error":"#N/A"},{"$error":"#N/A"},{"$error":"#N/A"},{"$error":"#N/A"},{"$error":"#N/A"},{"$error":"#N/A"},{"$error":"#N/A"},{"$error":"#N/A"},{"$error":"#N/A"},{"$error":"#N/A"},{"$error":"#N/A"},{"$error":"#N/A"},{"$error":"#N/A"},{"$error":"#N/A"},{"$error":"#N/A"},{"$error":"#N/A"},{"$error":"#N/A"},{"$error":"#N/A"},{"$error":"#N/A"},{"$error":"#N/A"},{"$error":"#N/A"},{"$error":"#N/A"},{"$error":"#N/A"},{"$error":"#N/A"},{"$error":"#N/A"},{"$error":"#N/A"},{"$error":"#N/A"},{"$error":"#N/A"},{"$error":"#N/A"},{"$error":"#N/A"},{"$error":"#N/A"},{"$error":"#N/A"},{"$error":"#N/A"},{"$error":"#N/A"},{"$error":"#N/A"},{"$error":"#N/A"},{"$error":"#N/A"},{"$error":"#N/A"},{"$error":"#N/A"},{"$error":"#N/A"},{"$error":"#N/A"},{"$error":"#N/A"},{"$error":"#N/A"},{"$error":"#N/A"},{"$error":"#N/A"},{"$error":"#N/A"},{"$error":"#N/A"},{"$error":"#N/A"},{"$error":"#N/A"},{"$error":"#N/A"},{"$error":"#N/A"},{"$error":"#N/A"},{"$error":"#N/A"},{"$error":"#N/A"},{"$error":"#N/A"},{"$error":"#N/A"},{"$error":"#N/A"},{"$error":"#N/A"},{"$error":"#N/A"},{"$error":"#N/A"},{"$error":"#N/A"},{"$error":"#N/A"},{"$error":"#N/A"},{"$error":"#N/A"},{"$error":"#N/A"},{"$error":"#N/A"},{"$error":"#N/A"},{"$error":"#N/A"},{"$error":"#N/A"},{"$error":"#N/A"},{"$error":"#N/A"},{"$error":"#N/A"},{"$error":"#N/A"},{"$error":"#N/A"},{"$error":"#N/A"},{"$error":"#N/A"},{"$error":"#N/A"},{"$error":"#N/A"},{"$error":"#N/A"},{"$error":"#N/A"},{"$error":"#N/A"},{"$error":"#N/A"},{"$error":"#N/A"},{"$error":"#N/A"},{"$error":"#N/A"},{"$error":"#N/A"},{"$error":"#N/A"},{"$error":"#N/A"},{"$error":"#N/A"},{"$error":"#N/A"},{"$error":"#N/A"},{"$error":"#N/A"},{"$error":"#N/A"},{"$error":"#N/A"},{"$error":"#N/A"},{"$error":"#N/A"},{"$error":"#N/A"},{"$error":"#N/A"},{"$error":"#N/A"},{"$error":"#N/A"},{"$error":"#N/A"},{"$error":"#N/A"},{"$error":"#N/A"},{"$error":"#N/A"},{"$error":"#N/A"},{"$error":"#N/A"},{"$error":"#N/A"},{"$error":"#N/A"},{"$error":"#N/A"},{"$error":"#N/A"},{"$error":"#N/A"},{"$error":"#N/A"},{"$error":"#N/A"},{"$error":"#N/A"},{"$error":"#N/A"},{"$error":"#N/A"},{"$error":"#N/A"},{"$error":"#N/A"},{"$error":"#N/A"},{"$error":"#N/A"},{"$error":"#N/A"},{"$error":"#N/A"},{"$error":"#N/A"},{"$error":"#N/A"}]