{"text_format":"3","workbook":"xlsx","n_sheets":2,"sheets":["Dashboard","Dateneingabe"],"not_rendered":{"charts":5,"images":3,"defined_names":5},"read":"whole","date_system":"1900"}

{"sheet":"Dashboard","index":0,"n_rows":48,"n_cols":14,"rows_kept":48,"merged":[[7,12,9,14],[11,3,11,4],[12,1,12,2],[12,3,12,4]]}
[]
[]
[]
[]
[{"$nulls":5},{"$f":"\"Fitness-Dashboard für - \"&Dateneingabe!H2","v":"Fitness-Dashboard für - Paul"}]
[null,"DETAILS UND ZIELE",{"$nulls":6},"FORTSCHRITT"]
[]
[null,"STARTDATUM","STARTGEWICHT",null,"GRÖSSE",{"$nulls":7},{"$f":"(Startweight-LastWeight)/(Startweight-TargetWeight)","v":{"v":0.6,"d":"60%"}},{"v":1,"d":"100%"}]
[null,{"$f":"INDEX(Dateneingabe!$B:$B,MIN(IF(ISBLANK(Dateneingabe!$B$8:$B$35), 65535, ROW(Dateneingabe!$B$8:$B$35))))","v":"2016-06-10"},{"$f":"INDEX(Dateneingabe!C:C,MIN(IF(ISBLANK(Dateneingabe!$C$8:$C$35), 65535, ROW(Dateneingabe!$C$8:$C$35))))","v":{"v":98,"d":"98 KG"}},null,{"$f":"Dateneingabe!H3","v":{"v":180,"d":"180 CM"}}]
[]
[{"$nulls":12},{"$f":"IF(M8>=1,\"Glückwunsch!\",\"DES WEGES SIND GESCHAFFT!\")","v":"DES WEGES SIND GESCHAFFT!"}]
[null,"ZIELGEWICHT",null,"TRAININGSTAGE GESAMT"]
[null,{"$f":"Dateneingabe!H5","v":{"v":88,"d":"88 KG"}},null,{"$f":"COUNTA(Dateneingabe!B8:B35)","v":{"v":28,"d":"28 TAGE"}}]
[]
[null,"BMI"]
[null,{"$f":"(LastWeight/(Height/100)^2)","v":{"v":28.39506172839506,"d":"28.40"}}]
[]
[]
[null,"GEWICHT",{"$nulls":6},"NAHRUNGSAUFNAHME"]
{"$rows_empty":9}
[null,"SCHRITTZÄHLER"]
{"$rows_empty":18}
[null,"KALORIENVERBRAUCH"]

{"sheet":"Dateneingabe","index":1,"n_rows":35,"n_cols":10,"rows_kept":35,"merged":[[1,2,3,4]]}
[]
[null,null,"Fitnesstracker",{"$nulls":3},"NAME","Paul"]
[{"$nulls":6},"GRÖSSE",{"v":180,"d":"180 CM"}]
[{"$nulls":6},"STARTGEWICHT",{"$f":"INDEX(Dateneingabe!C:C,MIN(IF(ISBLANK(Dateneingabe!$C$8:$C$35), 65535, ROW(Dateneingabe!$C$8:$C$35))))","v":{"v":98,"d":"98.0 KG"}}]
[{"$nulls":6},"ZIELGEWICHT",{"v":88,"d":"88 KG"}]
[]
[null,"Datum","Gewicht (kg)","Schrittzähler (km)","KALORIEN-VERBRAUCH","PROTEINE (g)","KOHLEN-HYDRATE (g)","FETTE (g)","ZUCKER (g)","WASSER (l)"]
[null,"2016-06-10",{"v":98,"d":"98.0"},{"v":8,"d":"8.0"},{"v":1100,"d":"1100.0"},{"v":32,"d":"32.0"},{"v":31,"d":"31.0"},{"v":40,"d":"40.0"},6.8,{"v":3,"d":"3.0"}]
[null,"2016-06-11",{"v":98,"d":"98.0"},{"v":7,"d":"7.0"},{"v":1500,"d":"1500.0"},{"v":32,"d":"32.0"},{"v":31,"d":"31.0"},39.5,6.7,2.5]
[null,"2016-06-12",97.9,7.7,{"v":1900,"d":"1900.0"},{"v":32,"d":"32.0"},{"v":31,"d":"31.0"},39.5,6.7,{"v":3,"d":"3.0"}]
[null,"2016-06-13",97.5,{"v":9,"d":"9.0"},{"v":2000,"d":"2000.0"},{"v":32,"d":"32.0"},{"v":28,"d":"28.0"},{"v":39,"d":"39.0"},6.3,3.5]
[null,"2016-06-14",97.4,8.5,{"v":1500,"d":"1500.0"},{"v":32,"d":"32.0"},{"v":28,"d":"28.0"},{"v":39,"d":"39.0"},6.3,2.5]
[null,"2016-06-15",97.2,{"v":10,"d":"10.0"},{"v":1600,"d":"1600.0"},{"v":32,"d":"32.0"},{"v":28,"d":"28.0"},{"v":39,"d":"39.0"},6.3,{"v":3,"d":"3.0"}]
[null,"2016-06-16",{"v":96,"d":"96.0"},{"v":8,"d":"8.0"},{"v":2000,"d":"2000.0"},{"v":32,"d":"32.0"},{"v":28,"d":"28.0"},{"v":38,"d":"38.0"},6.3,{"v":3,"d":"3.0"}]
[null,"2016-06-17",96.9,6.5,{"v":1500,"d":"1500.0"},31.5,27.5,{"v":38,"d":"38.0"},6.3,2.5]
[null,"2016-06-18",96.9,{"v":8,"d":"8.0"},{"v":1500,"d":"1500.0"},31.5,{"v":27.25,"d":"27.3"},{"v":37.75,"d":"37.8"},6.3,{"v":3,"d":"3.0"}]
[null,"2016-06-19",96.7,{"v":9,"d":"9.0"},{"v":1900,"d":"1900.0"},31.5,{"v":27,"d":"27.0"},{"v":37,"d":"37.0"},6.3,3.5]
[null,"2016-06-20",96.5,{"v":7,"d":"7.0"},{"v":2000,"d":"2000.0"},{"v":31,"d":"31.0"},{"v":27,"d":"27.0"},{"v":37,"d":"37.0"},6.3,{"v":3,"d":"3.0"}]
[null,"2016-06-21",96.6,{"v":8,"d":"8.0"},{"v":1500,"d":"1500.0"},{"v":31,"d":"31.0"},{"v":27,"d":"27.0"},{"v":37,"d":"37.0"},6.2,2.5]
[null,"2016-06-22",96.4,{"v":9,"d":"9.0"},{"v":1500,"d":"1500.0"},{"v":31,"d":"31.0"},{"v":27,"d":"27.0"},{"v":36,"d":"36.0"},6.2,{"v":3,"d":"3.0"}]
[null,"2016-06-23",96.4,{"v":7,"d":"7.0"},{"v":1300,"d":"1300.0"},{"v":31,"d":"31.0"},{"v":26,"d":"26.0"},{"v":36,"d":"36.0"},6.2,3.5]
[null,"2016-06-24",{"v":95,"d":"95.0"},{"v":9,"d":"9.0"},{"v":1400,"d":"1400.0"},{"v":31,"d":"31.0"},{"v":26,"d":"26.0"},{"v":36,"d":"36.0"},6.2,2.5]
[null,"2016-06-25",95.2,9.5,{"v":1700,"d":"1700.0"},{"v":31,"d":"31.0"},{"v":26,"d":"26.0"},{"v":35,"d":"35.0"},{"v":6,"d":"6.0"},{"v":3,"d":"3.0"}]
[null,"2016-06-26",{"v":95,"d":"95.0"},8.5,{"v":2000,"d":"2000.0"},{"v":31,"d":"31.0"},{"v":26,"d":"26.0"},{"v":35,"d":"35.0"},{"v":6,"d":"6.0"},2.5]
[null,"2016-06-27",94.9,8.5,{"v":1900,"d":"1900.0"},{"v":31,"d":"31.0"},{"v":26,"d":"26.0"},{"v":35,"d":"35.0"},{"v":6,"d":"6.0"},{"v":3,"d":"3.0"}]
[null,"2016-06-28",94.3,7.5,{"v":1400,"d":"1400.0"},{"v":31,"d":"31.0"},{"v":26,"d":"26.0"},{"v":35,"d":"35.0"},{"v":6,"d":"6.0"},3.5]
[null,"2016-06-29",94.2,{"v":8,"d":"8.0"},{"v":1400,"d":"1400.0"},{"v":31,"d":"31.0"},{"v":26,"d":"26.0"},{"v":35,"d":"35.0"},{"v":6,"d":"6.0"},{"v":3,"d":"3.0"}]
[null,"2016-06-30",94.1,{"v":7,"d":"7.0"},{"v":1300,"d":"1300.0"},{"v":31,"d":"31.0"},{"v":26,"d":"26.0"},{"v":35,"d":"35.0"},{"v":6,"d":"6.0"},2.5]
[null,"2016-07-01",{"v":94,"d":"94.0"},6.7,{"v":1400,"d":"1400.0"},{"v":31,"d":"31.0"},{"v":26,"d":"26.0"},{"v":36,"d":"36.0"},6.2,{"v":3,"d":"3.0"}]
[null,"2016-07-02",{"v":94,"d":"94.0"},8.7,{"v":1700,"d":"1700.0"},{"v":31,"d":"31.0"},{"v":26,"d":"26.0"},{"v":35,"d":"35.0"},{"v":6,"d":"6.0"},3.5]
[null,"2016-07-03",94.1,8.6,{"v":1900,"d":"1900.0"},{"v":31,"d":"31.0"},{"v":26,"d":"26.0"},{"v":35,"d":"35.0"},{"v":6,"d":"6.0"},{"v":3,"d":"3.0"}]
[null,"2016-07-04",93.5,{"v":9,"d":"9.0"},{"v":1900,"d":"1900.0"},{"v":31,"d":"31.0"},{"v":26,"d":"26.0"},{"v":35,"d":"35.0"},{"v":6,"d":"6.0"},2.5]
[null,"2016-07-05",93.3,7.8,{"v":1400,"d":"1400.0"},{"v":31,"d":"31.0"},{"v":26,"d":"26.0"},{"v":35,"d":"35.0"},{"v":6,"d":"6.0"},{"v":3,"d":"3.0"}]
[null,"2016-07-06",93.2,7.8,{"v":1400,"d":"1400.0"},{"v":31,"d":"31.0"},{"v":26,"d":"26.0"},{"v":35,"d":"35.0"},{"v":6,"d":"6.0"},3.5]
[null,"2016-07-07",{"v":92,"d":"92.0"},8.5,{"v":1350,"d":"1350.0"},{"v":31,"d":"31.0"},{"v":26,"d":"26.0"},{"v":35,"d":"35.0"},{"v":6,"d":"6.0"},2.5]