{"text_format":"3","workbook":"xlsx","n_sheets":4,"sheets":["START","PROJEKTPARAMETER","PROJEKTDETAILS","PROJEKTSUMMEN"],"not_rendered":{"charts":2,"defined_names":3,"pivot_tables":1},"read":"whole","date_system":"1900"}

{"sheet":"START","index":0,"n_rows":7,"n_cols":2,"rows_kept":7}
[null,"ÜBER DIESE VORLAGE"]
[null,"Verfolgen Sie in der Arbeitsmappe \"Tracker für Veranstaltungsplanung\" Projektparameter, Projektdetails und Projektsummen nach."]
[null,"Geben Sie Informationen im Arbeitsblatt \"Projektparameter\" (zum Aktualisieren der Säulendiagramme) und im Arbeitsblatt \"Projektdetails\"ein. Die PivotTable im Arbeitsblatt \"Projektsummen\" wird automatisch aktualisiert."]
[null,"Geben Sie im Arbeitsblatt \"Parameter\" den Firmenname ein. Dann wird er in anderen Arbeitsblättern automatisch aktualisiert."]
[null,"Anmerkung:  "]
[null,"Weitere Anweisungen wurden in Spalte A jedes Arbeitsblatts in der Arbeitsmappe TRACKER FÜR VERANSTALTUNGSPLANUNG bereitgestellt. Diese Texte wurden absichtlich ausgeblendet. Um die Texte zu entfernen, wählen Sie Spalte A und dann ENTF aus. Um die Texte einzublenden, wählen Sie Spalte A aus, und ändern Sie die Schriftfarbe."]
{"$rows_left_out":2}
{"sheet":"PROJEKTPARAMETER","index":1,"n_rows":24,"n_cols":9,"rows_kept":24,"merged":[[23,1,42,3]]}
["Erstellen Sie Projektparameter in diesem Arbeitsblatt. Geben Sie den Firmenname in der Zelle rechts ein. Hilfreiche Anweisungen stehen in Zellen in dieser Spalte. Drücken Sie die NACH-UNTEN-TASTE, um anzufangen.","Firmenname"]
["Der Titel dieses Arbeitsblatts steht in der Zelle rechts.","Projekt-Tracker \"Veranstaltungsmanagement\""]
["Die Vertraulichkeitsnachricht steht in der Zelle rechts.",{"$f":"\"Vertraulicher \"&B1","v":"Vertraulicher Firmenname"}]
["Der Tipp steht in der Zelle rechts.","Schattierte Zellen werden automatisch berechnet. Sie brauchen darin nichts einzugeben."]
["Geben Sie Details in der Tabelle \"Parameter\" ab der Zelle rechts ein. Die nächste Anweisung finden Sie in Zelle A12.","PROJEKTTYP","KUNDENBETREUER","PROJEKTMANAGER","STRATEGIEMANAGER","DESIGNSPEZIALIST","VERANSTALTUNGSPERSONAL","VERWALTUNGSPERSONAL","Ergebnis"]
[null,"Entwicklung des Veranstaltungskonzepts",{"v":0.2,"d":"20%"},{"v":0.1,"d":"10%"},{"v":0.6,"d":"60%"},{"v":0,"d":"0%"},{"v":0,"d":"0%"},{"v":0.1,"d":"10%"},{"$f":"SUM(Parameter[[#This Row],[KUNDENBETREUER]:[VERWALTUNGSPERSONAL]])","v":{"v":1,"d":"100%"}}]
{"$rows_left_out":19}
{"sheet":"PROJEKTDETAILS","index":2,"n_rows":10,"n_cols":23,"rows_kept":10}
["Erstellen Sie Projektdetails in diesem Arbeitsblatt. Der Firmenname in der Zelle rechts wird automatisch aktualisiert. Hilfreiche Anweisungen stehen in Zellen in dieser Spalte. Drücken Sie die NACH-UNTEN-TASTE, um anzufangen.",{"$f":"PROJEKTPARAMETER!B1","v":"Firmenname"}]
["Der Titel dieses Arbeitsblatts steht in der Zelle rechts.","Projekt-Tracker \"Veranstaltungsmanagement\""]
["Die Vertraulichkeitsnachricht steht in der Zelle rechts.",{"$f":"PROJEKTPARAMETER!B3","v":"Vertraulicher Firmenname"}]
["Geben Sie Informationen in der Tabelle \"Projektdetails\" ab der Zelle rechts ein.\nINFO\nWenn Sie in der Tabelle rechts eine Zeile hinzufügen möchten, wählen Sie die Zelle unten rechts im Textkörper (nicht die Ergebniszeile) aus, und drücken Sie die TAB-Taste, oder drücken Sie in der Tabelle dort, wo die Zeile eingefügt werden soll, UMSCHALT+F10, und wählen Sie \"Einfügen\" | \"Tabellenzeilen Oben/Unten\" aus. \nAchten Sie darauf, dass alle nicht genutzten Zeilen gelöscht werden, da die PivotTable PROJEKTSUMMEN alle Zellen der Tabelle verwendet und ansonsten fehlerhafte Ergebnisse ausgegeben würden.","PROJEKTNAME","PROJEKTTYP","VORAUSSICHTLICHER START","VORAUSSICHTLICHES ENDE","TATSÄCHLICHER START","TATSÄCHLICHES ENDE","GESCHÄTZTE ARBEIT","IST-ARBEIT","GESCHÄTZTE DAUER","TATSÄCHLICHE DAUER","KUNDENBETREUER","PROJEKTMANAGER","STRATEGIEMANAGER","DESIGNSPEZIALIST","VERANSTALTUNGSPERSONAL","VERWALTUNGSPERSONAL","KUNDENBETREUER ","PROJEKTMANAGER ","STRATEGIEMANAGER ","DESIGNSPEZIALIST ","VERANSTALTUNGSPERSONAL ","VERWALTUNGSPERSONAL "]
[null,"Projekt 1","Entwicklung des Veranstaltungskonzepts",{"$f":"DATE(YEAR(TODAY()),6,9)","v":"2019-06-09"},{"$f":"DATE(YEAR(TODAY()),8,7)","v":"2019-08-07"},{"$f":"DATE(YEAR(TODAY()),6,29)","v":"2019-06-29"},{"$f":"DATE(YEAR(TODAY()),9,3)","v":"2019-09-03"},200,220,{"$f":"DAYS360(ProjektDetails[[#This Row],[VORAUSSICHTLICHER START]],ProjektDetails[[#This Row],[VORAUSSICHTLICHES ENDE]],FALSE)","v":58},{"$f":"DAYS360(ProjektDetails[[#This Row],[TATSÄCHLICHER START]],ProjektDetails[[#This Row],[TATSÄCHLICHES ENDE]],FALSE)","v":64},{"$f":"INDEX(Parameter[],MATCH(ProjektDetails[[#This Row],[PROJEKTTYP]],Parameter[PROJEKTTYP],0),MATCH(ProjektDetails[[#Headers],[KUNDENBETREUER]],Parameter[#Headers],0))*INDEX(PROJEKTPARAMETER!$B$12:$H$12,1,MATCH(ProjektDetails[[#Headers],[KUNDENBETREUER]],Parameter[#Headers],0))*ProjektDetails[[#This Row],[GESCHÄTZTE ARBEIT]]","v":{"v":7200,"d":"7,200 €"}},{"$f":"INDEX(Parameter[],MATCH(ProjektDetails[[#This Row],[PROJEKTTYP]],Parameter[PROJEKTTYP],0),MATCH(ProjektDetails[[#Headers],[PROJEKTMANAGER]],Parameter[#Headers],0))*INDEX(PROJEKTPARAMETER!$B$12:$H$12,1,MATCH(ProjektDetails[[#Headers],[PROJEKTMANAGER]],Parameter[#Headers],0))*ProjektDetails[[#This Row],[GESCHÄTZTE ARBEIT]]","v":{"v":2400,"d":"2,400 €"}},{"$f":"INDEX(Parameter[],MATCH(ProjektDetails[[#This Row],[PROJEKTTYP]],Parameter[PROJEKTTYP],0),MATCH(ProjektDetails[[#Headers],[STRATEGIEMANAGER]],Parameter[#Headers],0))*INDEX(PROJEKTPARAMETER!$B$12:$H$12,1,MATCH(ProjektDetails[[#Headers],[STRATEGIEMANAGER]],Parameter[#Headers],0))*ProjektDetails[[#This Row],[GESCHÄTZTE ARBEIT]]","v":{"v":18000,"d":"18,000 €"}},{"$f":"INDEX(Parameter[],MATCH(ProjektDetails[[#This Row],[PROJEKTTYP]],Parameter[PROJEKTTYP],0),MATCH(ProjektDetails[[#Headers],[DESIGNSPEZIALIST]],Parameter[#Headers],0))*INDEX(PROJEKTPARAMETER!$B$12:$H$12,1,MATCH(ProjektDetails[[#Headers],[DESIGNSPEZIALIST]],Parameter[#Headers],0))*ProjektDetails[[#This Row],[GESCHÄTZTE ARBEIT]]","v":{"v":0,"d":"0 €"}},{"$f":"INDEX(Parameter[],MATCH(ProjektDetails[[#This Row],[PROJEKTTYP]],Parameter[PROJEKTTYP],0),MATCH(ProjektDetails[[#Headers],[VERANSTALTUNGSPERSONAL]],Parameter[#Headers],0))*INDEX(PROJEKTPARAMETER!$B$12:$H$12,1,MATCH(ProjektDetails[[#Headers],[VERANSTALTUNGSPERSONAL]],Parameter[#Headers],0))*ProjektDetails[[#This Row],[GESCHÄTZTE ARBEIT]]","v":{"v":0,"d":"0 €"}},{"$f":"INDEX(Parameter[],MATCH(ProjektDetails[[#This Row],[PROJEKTTYP]],Parameter[PROJEKTTYP],0),MATCH(ProjektDetails[[#Headers],[VERWALTUNGSPERSONAL]],Parameter[#Headers],0))*INDEX(PROJEKTPARAMETER!$B$12:$H$12,1,MATCH(ProjektDetails[[#Headers],[VERWALTUNGSPERSONAL]],Parameter[#Headers],0))*ProjektDetails[[#This Row],[GESCHÄTZTE ARBEIT]]","v":{"v":1200,"d":"1,200 €"}},{"$f":"INDEX(Parameter[],MATCH(ProjektDetails[[#This Row],[PROJEKTTYP]],Parameter[PROJEKTTYP],0),MATCH(ProjektDetails[[#Headers],[KUNDENBETREUER]],Parameter[#Headers],0))*INDEX(PROJEKTPARAMETER!$B$12:$H$12,1,MATCH(ProjektDetails[[#Headers],[KUNDENBETREUER]],Parameter[#Headers],0))*ProjektDetails[[#This Row],[IST-ARBEIT]]","v":{"v":7920,"d":"7,920 €"}},{"$f":"INDEX(Parameter[],MATCH(ProjektDetails[[#This Row],[PROJEKTTYP]],Parameter[PROJEKTTYP],0),MATCH(ProjektDetails[[#Headers],[PROJEKTMANAGER]],Parameter[#Headers],0))*INDEX(PROJEKTPARAMETER!$B$12:$H$12,1,MATCH(ProjektDetails[[#Headers],[PROJEKTMANAGER]],Parameter[#Headers],0))*ProjektDetails[[#This Row],[IST-ARBEIT]]","v":{"v":2640,"d":"2,640 €"}},{"$f":"INDEX(Parameter[],MATCH(ProjektDetails[[#This Row],[PROJEKTTYP]],Parameter[PROJEKTTYP],0),MATCH(ProjektDetails[[#Headers],[STRATEGIEMANAGER]],Parameter[#Headers],0))*INDEX(PROJEKTPARAMETER!$B$12:$H$12,1,MATCH(ProjektDetails[[#Headers],[STRATEGIEMANAGER]],Parameter[#Headers],0))*ProjektDetails[[#This Row],[IST-ARBEIT]]","v":{"v":19800,"d":"19,800 €"}},{"$f":"INDEX(Parameter[],MATCH(ProjektDetails[[#This Row],[PROJEKTTYP]],Parameter[PROJEKTTYP],0),MATCH(ProjektDetails[[#Headers],[DESIGNSPEZIALIST]],Parameter[#Headers],0))*INDEX(PROJEKTPARAMETER!$B$12:$H$12,1,MATCH(ProjektDetails[[#Headers],[DESIGNSPEZIALIST]],Parameter[#Headers],0))*ProjektDetails[[#This Row],[IST-ARBEIT]]","v":{"v":0,"d":"0 €"}},{"$f":"INDEX(Parameter[],MATCH(ProjektDetails[[#This Row],[PROJEKTTYP]],Parameter[PROJEKTTYP],0),MATCH(ProjektDetails[[#Headers],[VERANSTALTUNGSPERSONAL]],Parameter[#Headers],0))*INDEX(PROJEKTPARAMETER!$B$12:$H$12,1,MATCH(ProjektDetails[[#Headers],[VERANSTALTUNGSPERSONAL]],Parameter[#Headers],0))*ProjektDetails[[#This Row],[IST-ARBEIT]]","v":{"v":0,"d":"0 €"}},{"$f":"INDEX(Parameter[],MATCH(ProjektDetails[[#This Row],[PROJEKTTYP]],Parameter[PROJEKTTYP],0),MATCH(ProjektDetails[[#Headers],[VERWALTUNGSPERSONAL]],Parameter[#Headers],0))*INDEX(PROJEKTPARAMETER!$B$12:$H$12,1,MATCH(ProjektDetails[[#Headers],[VERWALTUNGSPERSONAL]],Parameter[#Headers],0))*ProjektDetails[[#This Row],[IST-ARBEIT]]","v":{"v":1320,"d":"1,320 €"}}]
[null,"Projekt 2","Veranstaltungsplanung",{"$f":"DATE(YEAR(TODAY())+1,6,25)","v":"2020-06-25"},{"$f":"DATE(YEAR(TODAY())+1,7,27)","v":"2020-07-27"},{"$f":"DATE(YEAR(TODAY()),7,15)","v":"2019-07-15"},{"$f":"DATE(YEAR(TODAY())+1,8,25)","v":"2020-08-25"},400,390,{"$f":"DAYS360(ProjektDetails[[#This Row],[VORAUSSICHTLICHER START]],ProjektDetails[[#This Row],[VORAUSSICHTLICHES ENDE]],FALSE)","v":32},{"$f":"DAYS360(ProjektDetails[[#This Row],[TATSÄCHLICHER START]],ProjektDetails[[#This Row],[TATSÄCHLICHES ENDE]],FALSE)","v":400},{"$f":"INDEX(Parameter[],MATCH(ProjektDetails[[#This Row],[PROJEKTTYP]],Parameter[PROJEKTTYP],0),MATCH(ProjektDetails[[#Headers],[KUNDENBETREUER]],Parameter[#Headers],0))*INDEX(PROJEKTPARAMETER!$B$12:$H$12,1,MATCH(ProjektDetails[[#Headers],[KUNDENBETREUER]],Parameter[#Headers],0))*ProjektDetails[[#This Row],[GESCHÄTZTE ARBEIT]]","v":{"v":14400,"d":"14,400 €"}},{"$f":"INDEX(Parameter[],MATCH(ProjektDetails[[#This Row],[PROJEKTTYP]],Parameter[PROJEKTTYP],0),MATCH(ProjektDetails[[#Headers],[PROJEKTMANAGER]],Parameter[#Headers],0))*INDEX(PROJEKTPARAMETER!$B$12:$H$12,1,MATCH(ProjektDetails[[#Headers],[PROJEKTMANAGER]],Parameter[#Headers],0))*ProjektDetails[[#This Row],[GESCHÄTZTE ARBEIT]]","v":{"v":24000,"d":"24,000 €"}},{"$f":"INDEX(Parameter[],MATCH(ProjektDetails[[#This Row],[PROJEKTTYP]],Parameter[PROJEKTTYP],0),MATCH(ProjektDetails[[#Headers],[STRATEGIEMANAGER]],Parameter[#Headers],0))*INDEX(PROJEKTPARAMETER!$B$12:$H$12,1,MATCH(ProjektDetails[[#Headers],[STRATEGIEMANAGER]],Parameter[#Headers],0))*ProjektDetails[[#This Row],[GESCHÄTZTE ARBEIT]]","v":{"v":6000,"d":"6,000 €"}},{"$f":"INDEX(Parameter[],MATCH(ProjektDetails[[#This Row],[PROJEKTTYP]],Parameter[PROJEKTTYP],0),MATCH(ProjektDetails[[#Headers],[DESIGNSPEZIALIST]],Parameter[#Headers],0))*INDEX(PROJEKTPARAMETER!$B$12:$H$12,1,MATCH(ProjektDetails[[#Headers],[DESIGNSPEZIALIST]],Parameter[#Headers],0))*ProjektDetails[[#This Row],[GESCHÄTZTE ARBEIT]]","v":{"v":4000,"d":"4,000 €"}},{"$f":"INDEX(Parameter[],MATCH(ProjektDetails[[#This Row],[PROJEKTTYP]],Parameter[PROJEKTTYP],0),MATCH(ProjektDetails[[#Headers],[VERANSTALTUNGSPERSONAL]],Parameter[#Headers],0))*INDEX(PROJEKTPARAMETER!$B$12:$H$12,1,MATCH(ProjektDetails[[#Headers],[VERANSTALTUNGSPERSONAL]],Parameter[#Headers],0))*ProjektDetails[[#This Row],[GESCHÄTZTE ARBEIT]]","v":{"v":0,"d":"0 €"}},{"$f":"INDEX(Parameter[],MATCH(ProjektDetails[[#This Row],[PROJEKTTYP]],Parameter[PROJEKTTYP],0),MATCH(ProjektDetails[[#Headers],[VERWALTUNGSPERSONAL]],Parameter[#Headers],0))*INDEX(PROJEKTPARAMETER!$B$12:$H$12,1,MATCH(ProjektDetails[[#Headers],[VERWALTUNGSPERSONAL]],Parameter[#Headers],0))*ProjektDetails[[#This Row],[GESCHÄTZTE ARBEIT]]","v":{"v":2400,"d":"2,400 €"}},{"$f":"INDEX(Parameter[],MATCH(ProjektDetails[[#This Row],[PROJEKTTYP]],Parameter[PROJEKTTYP],0),MATCH(ProjektDetails[[#Headers],[KUNDENBETREUER]],Parameter[#Headers],0))*INDEX(PROJEKTPARAMETER!$B$12:$H$12,1,MATCH(ProjektDetails[[#Headers],[KUNDENBETREUER]],Parameter[#Headers],0))*ProjektDetails[[#This Row],[IST-ARBEIT]]","v":{"v":14040,"d":"14,040 €"}},{"$f":"INDEX(Parameter[],MATCH(ProjektDetails[[#This Row],[PROJEKTTYP]],Parameter[PROJEKTTYP],0),MATCH(ProjektDetails[[#Headers],[PROJEKTMANAGER]],Parameter[#Headers],0))*INDEX(PROJEKTPARAMETER!$B$12:$H$12,1,MATCH(ProjektDetails[[#Headers],[PROJEKTMANAGER]],Parameter[#Headers],0))*ProjektDetails[[#This Row],[IST-ARBEIT]]","v":{"v":23400,"d":"23,400 €"}},{"$f":"INDEX(Parameter[],MATCH(ProjektDetails[[#This Row],[PROJEKTTYP]],Parameter[PROJEKTTYP],0),MATCH(ProjektDetails[[#Headers],[STRATEGIEMANAGER]],Parameter[#Headers],0))*INDEX(PROJEKTPARAMETER!$B$12:$H$12,1,MATCH(ProjektDetails[[#Headers],[STRATEGIEMANAGER]],Parameter[#Headers],0))*ProjektDetails[[#This Row],[IST-ARBEIT]]","v":{"v":5850,"d":"5,850 €"}},{"$f":"INDEX(Parameter[],MATCH(ProjektDetails[[#This Row],[PROJEKTTYP]],Parameter[PROJEKTTYP],0),MATCH(ProjektDetails[[#Headers],[DESIGNSPEZIALIST]],Parameter[#Headers],0))*INDEX(PROJEKTPARAMETER!$B$12:$H$12,1,MATCH(ProjektDetails[[#Headers],[DESIGNSPEZIALIST]],Parameter[#Headers],0))*ProjektDetails[[#This Row],[IST-ARBEIT]]","v":{"v":3900,"d":"3,900 €"}},{"$f":"INDEX(Parameter[],MATCH(ProjektDetails[[#This Row],[PROJEKTTYP]],Parameter[PROJEKTTYP],0),MATCH(ProjektDetails[[#Headers],[VERANSTALTUNGSPERSONAL]],Parameter[#Headers],0))*INDEX(PROJEKTPARAMETER!$B$12:$H$12,1,MATCH(ProjektDetails[[#Headers],[VERANSTALTUNGSPERSONAL]],Parameter[#Headers],0))*ProjektDetails[[#This Row],[IST-ARBEIT]]","v":{"v":0,"d":"0 €"}},{"$f":"INDEX(Parameter[],MATCH(ProjektDetails[[#This Row],[PROJEKTTYP]],Parameter[PROJEKTTYP],0),MATCH(ProjektDetails[[#Headers],[VERWALTUNGSPERSONAL]],Parameter[#Headers],0))*INDEX(PROJEKTPARAMETER!$B$12:$H$12,1,MATCH(ProjektDetails[[#Headers],[VERWALTUNGSPERSONAL]],Parameter[#Headers],0))*ProjektDetails[[#This Row],[IST-ARBEIT]]","v":{"v":2340,"d":"2,340 €"}}]
{"$rows_left_out":5}
{"sheet":"PROJEKTSUMMEN","index":3,"n_rows":10,"n_cols":14,"rows_kept":10}
["Erhalten Sie Projektsummen in diesem Arbeitsblatt. Der Firmenname in der Zelle rechts wird automatisch aktualisiert. Hilfreiche Anweisungen stehen in Zellen in dieser Spalte. Drücken Sie die NACH-UNTEN-TASTE, um anzufangen.",{"$f":"PROJEKTPARAMETER!B1","v":"Firmenname"}]
["Der Titel dieses Arbeitsblatts steht in der Zelle rechts.","Projekt-Tracker \"Veranstaltungsmanagement\""]
["Die Vertraulichkeitsnachricht steht in der Zelle rechts.",{"$f":"PROJEKTPARAMETER!B3","v":"Vertraulicher Firmenname"}]
["Die PivotTable, die in der Zelle rechts beginnt, wird automatisch aktualisiert.\nINFO\nWenn Sie die PivotTable rechts aktualisieren möchten, wählen Sie sie aus (eine beliebige Zelle darin). Wählen Sie auf der Registerkarte des Menübands PIVOTTABLE-TOOLS | ANALYSIEREN die Option \"Aktualisieren\" aus, oder drücken Sie in einer beliebigen Zelle der PivotTable UMSCHALT+F10, und wählen Sie \"Aktualisieren\" aus.","PROJEKTNAME","KUNDENBETREUER SCHÄTZUNG","PROJEKTMANAGER SCHÄTZUNG","STRATEGIEMANAGER SCHÄTZUNG","DESIGNSPEZIALIST SCHÄTZUNG","VERANSTALTUNGSPERSONAL SCHÄTZUNG","VERWALTUNGSPERSONAL SCHÄTZUNG","KUNDENBETREUER TATSÄCHLICH","PROJEKTMANAGER TATSÄCHLICH","STRATEGIEMANAGER TATSÄCHLICH","DESIGNSPEZIALIST TATSÄCHLICH","VERANSTALTUNGSPERSONAL TATSÄCHLICH","VERWALTUNGSPERSONAL TATSÄCHLICH"]
[null,"Projekt 1",{"v":7200,"d":"7,200.00 €"},{"v":2400,"d":"2,400.00 €"},{"v":18000,"d":"18,000.00 €"},{"v":0,"d":"0.00 €"},{"v":0,"d":"0.00 €"},{"v":1200,"d":"1,200.00 €"},{"v":7920,"d":"7,920.00 €"},{"v":2640,"d":"2,640.00 €"},{"v":19800,"d":"19,800.00 €"},{"v":0,"d":"0.00 €"},{"v":0,"d":"0.00 €"},{"v":1320,"d":"1,320.00 €"}]
[null,"Projekt 2",{"v":14400,"d":"14,400.00 €"},{"v":24000,"d":"24,000.00 €"},{"v":6000,"d":"6,000.00 €"},{"v":4000,"d":"4,000.00 €"},{"v":0,"d":"0.00 €"},{"v":2400,"d":"2,400.00 €"},{"v":14040,"d":"14,040.00 €"},{"v":23400,"d":"23,400.00 €"},{"v":5850,"d":"5,850.00 €"},{"v":3900,"d":"3,900.00 €"},{"v":0,"d":"0.00 €"},{"v":2340,"d":"2,340.00 €"}]
{"$rows_left_out":4}