{"text_format":"3","workbook":"xlsx","n_sheets":4,"sheets":["Bewertungserfassung","Eigene Leistung","Einstellungen","Berechnungen"],"not_rendered":{"defined_names":3,"comments":1},"read":"whole","date_system":"1900"}

{"sheet":"Bewertungserfassung","index":0,"n_rows":14,"n_cols":6,"rows_kept":14}
[null,"Geben Sie hier Ihre Bewertungen ein"]
[]
[null,null,"Kurs","Typ","Beschreibung","Bewertung"]
[null,null,"Französisch","Hausaufgaben","Geschichte 2. Weltkrieg",{"v":0.8,"d":"80%"}]
[null,null,"Programmierung in Java - Fortgeschrittene","Zwischenprüfung",null,{"v":0.75,"d":"75%"}]
[null,null,"Spanisch","Hausaufgaben",null,{"v":0.5,"d":"50%"}]
[null,null,"Theoretische Physik","Hausaufgaben",null,{"v":0.95,"d":"95%"}]
[null,null,"Französisch","Hausaufgaben","Geschichte 1. Weltkrieg",{"v":0.9,"d":"90%"}]
[null,null,"Französisch","Hausaufgaben","Seiten 30 - 41",{"v":0.8,"d":"80%"}]
[null,null,"Freies Schreiben","Referat","Thesenpapier",{"v":0.95,"d":"95%"}]
[null,null,"Mathematik 1","Hausaufgaben","Seiten 21 + 26",{"v":0.8,"d":"80%"}]
[null,null,"Mathematik 2","Hausaufgaben","Seiten 15 + 18",{"v":0.85,"d":"85%"}]
[null,null,"Mathematik 1","Hausaufgaben","Seiten 34 - 36",{"v":0.8,"d":"80%"}]
[null,null,"Mathematik 2","Mündliche Prüfung",null,{"v":0.95,"d":"95%"}]

{"sheet":"Eigene Leistung","index":1,"n_rows":31,"n_cols":8,"rows_kept":31}
[null,"Eigene Leistung"]
[]
[null,null,"Summen"]
[null,null,{"$f":"\"Stunden: \"&SUM(tblKurse[Aufgewendete Stunden])","v":"Stunden: 24"},{"$f":"AVERAGE(D7:D31)","v":{"v":0.8104761904761906,"d":"81%"}},{"$f":"AVERAGE(E7:E31)","v":{"v":2.7142857142857144,"d":"2.71"}},{"$f":"SUM(F7:F31)","v":{"v":2.625,"d":"2.63"}},{"$f":"IFERROR(HLOOKUP(D4,lstDurchschnittsnotenZuordnung,2),\"\")","v":"B-"}]
[]
[null,null,"Kurse","%","Durchschnittsnote","gew.Durchschnittsnote","Einstufung","Gesamtleistung"]
[null,null,{"$f":"Berechnungen!C6","v":"Französisch"},{"$f":"Berechnungen!AL6","v":{"v":0.8333333333333334,"d":"83%"}},{"$f":"Berechnungen!AM6","v":{"v":3,"d":"3.00"}},{"$f":"IFERROR(E7*Einstellungen!D9/SUM(tblKurse[Aufgewendete Stunden]),\"\")","v":{"v":0.375,"d":"0.38"}},{"$f":"Berechnungen!AN6","v":"B"}]
[null,null,{"$f":"Berechnungen!C7","v":"Theoretische Physik"},{"$f":"Berechnungen!AL7","v":{"v":0.95,"d":"95%"}},{"$f":"Berechnungen!AM7","v":{"v":4,"d":"4.00"}},{"$f":"IFERROR(E8*Einstellungen!D10/SUM(tblKurse[Aufgewendete Stunden]),\"\")","v":{"v":0.5,"d":"0.50"}},{"$f":"Berechnungen!AN7","v":"A"}]
[null,null,{"$f":"Berechnungen!C8","v":"Mathematik 1"},{"$f":"Berechnungen!AL8","v":{"v":0.8000000000000002,"d":"80%"}},{"$f":"Berechnungen!AM8","v":2.67},{"$f":"IFERROR(E9*Einstellungen!D11/SUM(tblKurse[Aufgewendete Stunden]),\"\")","v":{"v":0.445,"d":"0.45"}},{"$f":"Berechnungen!AN8","v":"B-"}]
[null,null,{"$f":"Berechnungen!C9","v":"Mathematik 2"},{"$f":"Berechnungen!AL9","v":{"v":0.89,"d":"89%"}},{"$f":"Berechnungen!AM9","v":3.33},{"$f":"IFERROR(E10*Einstellungen!D12/SUM(tblKurse[Aufgewendete Stunden]),\"\")","v":{"v":0.555,"d":"0.56"}},{"$f":"Berechnungen!AN9","v":"B+"}]
[null,null,{"$f":"Berechnungen!C10","v":"Programmierung in Java - Fortgeschrittene"},{"$f":"Berechnungen!AL10","v":{"v":0.7500000000000001,"d":"75%"}},{"$f":"Berechnungen!AM10","v":{"v":2,"d":"2.00"}},{"$f":"IFERROR(E11*Einstellungen!D13/SUM(tblKurse[Aufgewendete Stunden]),\"\")","v":{"v":0.4166666666666667,"d":"0.42"}},{"$f":"Berechnungen!AN10","v":"C"}]
[null,null,{"$f":"Berechnungen!C11","v":"Spanisch"},{"$f":"Berechnungen!AL11","v":{"v":0.5,"d":"50%"}},{"$f":"Berechnungen!AM11","v":{"v":0,"d":"0.00"}},{"$f":"IFERROR(E12*Einstellungen!D14/SUM(tblKurse[Aufgewendete Stunden]),\"\")","v":{"v":0,"d":"0.00"}},{"$f":"Berechnungen!AN11","v":"F"}]
[null,null,{"$f":"Berechnungen!C12","v":"Freies Schreiben"},{"$f":"Berechnungen!AL12","v":{"v":0.95,"d":"95%"}},{"$f":"Berechnungen!AM12","v":{"v":4,"d":"4.00"}},{"$f":"IFERROR(E13*Einstellungen!D15/SUM(tblKurse[Aufgewendete Stunden]),\"\")","v":{"v":0.3333333333333333,"d":"0.33"}},{"$f":"Berechnungen!AN12","v":"A"}]
[null,null,{"$f":"Berechnungen!C13","v":""},{"$f":"Berechnungen!AL13","v":""},{"$f":"Berechnungen!AM13","v":""},{"$f":"IFERROR(E14*Einstellungen!D16/SUM(tblKurse[Aufgewendete Stunden]),\"\")","v":""},{"$f":"Berechnungen!AN13","v":""}]
[null,null,{"$f":"Berechnungen!C14","v":""},{"$f":"Berechnungen!AL14","v":""},{"$f":"Berechnungen!AM14","v":""},{"$f":"IFERROR(E15*Einstellungen!D17/SUM(tblKurse[Aufgewendete Stunden]),\"\")","v":""},{"$f":"Berechnungen!AN14","v":""}]
{"$rows_left_out":17}
{"sheet":"Einstellungen","index":2,"n_rows":15,"n_cols":16,"rows_kept":15,"merged":[[5,2,5,15]]}
[null,"Einstellungen"]
[null,null,"Zuordnung von Bewertungen und Durchschnittsnoten"]
[null,null,"Prozentsatz",{"v":0,"d":"0%"},{"v":0.6,"d":"60%"},{"v":0.63,"d":"63%"},{"v":0.67,"d":"67%"},{"v":0.7,"d":"70%"},{"v":0.73,"d":"73%"},{"v":0.77,"d":"77%"},{"v":0.8,"d":"80%"},{"v":0.83,"d":"83%"},{"v":0.87,"d":"87%"},{"v":0.9,"d":"90%"},{"v":0.93,"d":"93%"},{"v":0.97,"d":"97%"}]
[null,null,"Einstufung","F","D-","D","D+","C-","C","C+","B-","B","B+","A-","A","A+"]
[null,null,"Durchschnittsnote",0,0.67,1,1.33,1.67,2,2.33,2.67,3,3.33,3.67,4,4]
[]
[null,null,"Gewichtete Bewertungen für bis zu 25 Kurse"]
[null,null,"Belegte Kurse","Aufgewendete Stunden","Hausaufgaben","Referat","Mündliche Prüfung","Projekt","Zwischenprüfung","Abschlussprüfung","Sonstiges","Gesamtprozentsatz"]
[null,null,"Französisch",{"v":3,"d":"3.0"},{"v":0.1,"d":"10%"},{"v":0.15,"d":"15%"},{"v":0.15,"d":"15%"},{"v":0.1,"d":"10%"},{"v":0.2,"d":"20%"},{"v":0.3,"d":"30%"},null,{"$f":"SUM(tblKurse[[#This Row],[Hausaufgaben]:[Sonstiges]])","v":{"v":1,"d":"100%"}}]
[null,null,"Theoretische Physik",{"v":3,"d":"3.0"},{"v":0.15,"d":"15%"},{"v":0.15,"d":"15%"},{"v":0.1,"d":"10%"},{"v":0.1,"d":"10%"},{"v":0.15,"d":"15%"},{"v":0.3,"d":"30%"},{"v":0.05,"d":"5%"},{"$f":"SUM(tblKurse[[#This Row],[Hausaufgaben]:[Sonstiges]])","v":{"v":1,"d":"100%"}}]
[null,null,"Mathematik 1",{"v":4,"d":"4.0"},{"v":0.1,"d":"10%"},{"v":0.15,"d":"15%"},{"v":0.15,"d":"15%"},{"v":0.1,"d":"10%"},{"v":0.2,"d":"20%"},{"v":0.3,"d":"30%"},null,{"$f":"SUM(tblKurse[[#This Row],[Hausaufgaben]:[Sonstiges]])","v":{"v":1,"d":"100%"}}]
[null,null,"Mathematik 2",{"v":4,"d":"4.0"},{"v":0.15,"d":"15%"},{"v":0.15,"d":"15%"},{"v":0.1,"d":"10%"},{"v":0.1,"d":"10%"},{"v":0.15,"d":"15%"},{"v":0.3,"d":"30%"},{"v":0.05,"d":"5%"},{"$f":"SUM(tblKurse[[#This Row],[Hausaufgaben]:[Sonstiges]])","v":{"v":1,"d":"100%"}}]
[null,null,"Programmierung in Java - Fortgeschrittene",{"v":5,"d":"5.0"},{"v":0.15,"d":"15%"},{"v":0.15,"d":"15%"},{"v":0.1,"d":"10%"},{"v":0.1,"d":"10%"},{"v":0.2,"d":"20%"},{"v":0.3,"d":"30%"},null,{"$f":"SUM(tblKurse[[#This Row],[Hausaufgaben]:[Sonstiges]])","v":{"v":1,"d":"100%"}}]
[null,null,"Spanisch",{"v":3,"d":"3.0"},{"v":0.1,"d":"10%"},{"v":0.15,"d":"15%"},{"v":0.17,"d":"17%"},{"v":0.13,"d":"13%"},{"v":0.2,"d":"20%"},{"v":0.2,"d":"20%"},{"v":0.05,"d":"5%"},{"$f":"SUM(tblKurse[[#This Row],[Hausaufgaben]:[Sonstiges]])","v":{"v":1,"d":"100%"}}]
[null,null,"Freies Schreiben",{"v":2,"d":"2.0"},{"v":0.15,"d":"15%"},{"v":0.15,"d":"15%"},{"v":0.12,"d":"12%"},{"v":0.15,"d":"15%"},{"v":0.15,"d":"15%"},{"v":0.25,"d":"25%"},{"v":0.03,"d":"3%"},{"$f":"SUM(tblKurse[[#This Row],[Hausaufgaben]:[Sonstiges]])","v":{"v":1,"d":"100%"}}]
{"$rows_left_out":1}
{"sheet":"Berechnungen","index":3,"n_rows":657,"n_cols":40,"rows_kept":657,"hidden":true}
[null,"Berechnungen"]
[null,null,"Dieses Arbeitsblatt enthält Berechnungen Ihrer Noten und Durchschnittsnoten und sollte ausgeblendet bleiben. Jegliche Änderung an diesem Arbeitsblatt kann zu Fehlern führen."]
[]
[null,null,"Liste der aktuellen Kurse","Bewertungen (aus 1)",{"$nulls":24},"Notenberechnung"]
[null,null,"Kurs",1,2,3,4,5,6,7,8,9,10,11,12,13,14,15,16,17,18,19,20,21,22,23,24,25,{"$f":"tblKurse[[#Headers],[Hausaufgaben]]","v":"Hausaufgaben"},{"$f":"tblKurse[[#Headers],[Referat]]","v":"Referat"},{"$f":"tblKurse[[#Headers],[Mündliche Prüfung]]","v":"Mündliche Prüfung"},{"$f":"tblKurse[[#Headers],[Projekt]]","v":"Projekt"},{"$f":"tblKurse[[#Headers],[Zwischenprüfung]]","v":"Zwischenprüfung"},{"$f":"tblKurse[[#Headers],[Abschlussprüfung]]","v":"Abschlussprüfung"},{"$f":"tblKurse[[#Headers],[Sonstiges]]","v":"Sonstiges"},"Summe","Mögliche Gesamtpunktzahl","Gesamtprozentsatz","Note","Einstufung"]
[null,null,{"$f":"IF(Einstellungen!C9=\"\",\"\",Einstellungen!C9)","v":"Französisch"},{"$f":"IFERROR(INDEX(TblKlassenbewertungen[],MATCH($C6:$C30&D$5:AB$5,Berechnungen!$C$33:$C$657,0),4),\"\")","v":{"v":0.8,"d":"80%"}},{"v":0.9,"d":"90%"},{"v":0.8,"d":"80%"},"","","","","","","","","","","","","","","","","","","","","","",{"$f":"IFERROR(AVERAGEIFS(TblKlassenbewertungen[Bewertung],TblKlassenbewertungen[Kurs],Berechnungen!$C6,TblKlassenbewertungen[Typ],Berechnungen!AC$5)*Einstellungen!E9,\"\")","v":0.08333333333333334},{"$f":"IFERROR(AVERAGEIFS(TblKlassenbewertungen[Bewertung],TblKlassenbewertungen[Kurs],Berechnungen!$C6,TblKlassenbewertungen[Typ],Berechnungen!AD$5)*Einstellungen!F9,\"\")","v":""},{"$f":"IFERROR(AVERAGEIFS(TblKlassenbewertungen[Bewertung],TblKlassenbewertungen[Kurs],Berechnungen!$C6,TblKlassenbewertungen[Typ],Berechnungen!AE$5)*Einstellungen!G9,\"\")","v":""},{"$f":"IFERROR(AVERAGEIFS(TblKlassenbewertungen[Bewertung],TblKlassenbewertungen[Kurs],Berechnungen!$C6,TblKlassenbewertungen[Typ],Berechnungen!AF$5)*Einstellungen!H9,\"\")","v":""},{"$f":"IFERROR(AVERAGEIFS(TblKlassenbewertungen[Bewertung],TblKlassenbewertungen[Kurs],Berechnungen!$C6,TblKlassenbewertungen[Typ],Berechnungen!AG$5)*Einstellungen!I9,\"\")","v":""},{"$f":"IFERROR(AVERAGEIFS(TblKlassenbewertungen[Bewertung],TblKlassenbewertungen[Kurs],Berechnungen!$C6,TblKlassenbewertungen[Typ],Berechnungen!AH$5)*Einstellungen!J9,\"\")","v":""},{"$f":"IFERROR(AVERAGEIFS(TblKlassenbewertungen[Bewertung],TblKlassenbewertungen[Kurs],Berechnungen!$C6,TblKlassenbewertungen[Typ],Berechnungen!AI$5)*Einstellungen!K9,\"\")","v":""},{"$f":"SUM(AC6:AI6)","v":0.08333333333333334},{"$f":"SUMIFS(Einstellungen!E9:K9,Berechnungen!AC6:AI6,\">0\")","v":0.1},{"$f":"IFERROR(AJ6/AK6,\"\")","v":{"v":0.8333333333333334,"d":"83%"}},{"$f":"IFERROR(HLOOKUP(AL6,lstDurchschnittsnotenZuordnung,3),\"\")","v":3},{"$f":"IFERROR(HLOOKUP(AL6,lstDurchschnittsnotenZuordnung,2),\"\")","v":"B"}]
[null,null,{"$f":"IF(Einstellungen!C10=\"\",\"\",Einstellungen!C10)","v":"Theoretische Physik"},{"v":0.95,"d":"95%"},"","","","","","","","","","","","","","","","","","","","","","","","",{"$f":"IFERROR(AVERAGEIFS(TblKlassenbewertungen[Bewertung],TblKlassenbewertungen[Kurs],Berechnungen!$C7,TblKlassenbewertungen[Typ],Berechnungen!AC$5)*Einstellungen!E10,\"\")","v":0.1425},{"$f":"IFERROR(AVERAGEIFS(TblKlassenbewertungen[Bewertung],TblKlassenbewertungen[Kurs],Berechnungen!$C7,TblKlassenbewertungen[Typ],Berechnungen!AD$5)*Einstellungen!F10,\"\")","v":""},{"$f":"IFERROR(AVERAGEIFS(TblKlassenbewertungen[Bewertung],TblKlassenbewertungen[Kurs],Berechnungen!$C7,TblKlassenbewertungen[Typ],Berechnungen!AE$5)*Einstellungen!G10,\"\")","v":""},{"$f":"IFERROR(AVERAGEIFS(TblKlassenbewertungen[Bewertung],TblKlassenbewertungen[Kurs],Berechnungen!$C7,TblKlassenbewertungen[Typ],Berechnungen!AF$5)*Einstellungen!H10,\"\")","v":""},{"$f":"IFERROR(AVERAGEIFS(TblKlassenbewertungen[Bewertung],TblKlassenbewertungen[Kurs],Berechnungen!$C7,TblKlassenbewertungen[Typ],Berechnungen!AG$5)*Einstellungen!I10,\"\")","v":""},{"$f":"IFERROR(AVERAGEIFS(TblKlassenbewertungen[Bewertung],TblKlassenbewertungen[Kurs],Berechnungen!$C7,TblKlassenbewertungen[Typ],Berechnungen!AH$5)*Einstellungen!J10,\"\")","v":""},{"$f":"IFERROR(AVERAGEIFS(TblKlassenbewertungen[Bewertung],TblKlassenbewertungen[Kurs],Berechnungen!$C7,TblKlassenbewertungen[Typ],Berechnungen!AI$5)*Einstellungen!K10,\"\")","v":""},{"$f":"SUM(AC7:AI7)","v":0.1425},{"$f":"SUMIFS(Einstellungen!E10:K10,Berechnungen!AC7:AI7,\">0\")","v":0.15},{"$f":"IFERROR(AJ7/AK7,\"\")","v":{"v":0.95,"d":"95%"}},4,"A"]
[null,null,{"$f":"IF(Einstellungen!C11=\"\",\"\",Einstellungen!C11)","v":"Mathematik 1"},{"v":0.8,"d":"80%"},{"v":0.8,"d":"80%"},"","","","","","","","","","","","","","","","","","","","","","","",{"$f":"IFERROR(AVERAGEIFS(TblKlassenbewertungen[Bewertung],TblKlassenbewertungen[Kurs],Berechnungen!$C8,TblKlassenbewertungen[Typ],Berechnungen!AC$5)*Einstellungen!E11,\"\")","v":0.08000000000000002},{"$f":"IFERROR(AVERAGEIFS(TblKlassenbewertungen[Bewertung],TblKlassenbewertungen[Kurs],Berechnungen!$C8,TblKlassenbewertungen[Typ],Berechnungen!AD$5)*Einstellungen!F11,\"\")","v":""},{"$f":"IFERROR(AVERAGEIFS(TblKlassenbewertungen[Bewertung],TblKlassenbewertungen[Kurs],Berechnungen!$C8,TblKlassenbewertungen[Typ],Berechnungen!AE$5)*Einstellungen!G11,\"\")","v":""},{"$f":"IFERROR(AVERAGEIFS(TblKlassenbewertungen[Bewertung],TblKlassenbewertungen[Kurs],Berechnungen!$C8,TblKlassenbewertungen[Typ],Berechnungen!AF$5)*Einstellungen!H11,\"\")","v":""},{"$f":"IFERROR(AVERAGEIFS(TblKlassenbewertungen[Bewertung],TblKlassenbewertungen[Kurs],Berechnungen!$C8,TblKlassenbewertungen[Typ],Berechnungen!AG$5)*Einstellungen!I11,\"\")","v":""},{"$f":"IFERROR(AVERAGEIFS(TblKlassenbewertungen[Bewertung],TblKlassenbewertungen[Kurs],Berechnungen!$C8,TblKlassenbewertungen[Typ],Berechnungen!AH$5)*Einstellungen!J11,\"\")","v":""},{"$f":"IFERROR(AVERAGEIFS(TblKlassenbewertungen[Bewertung],TblKlassenbewertungen[Kurs],Berechnungen!$C8,TblKlassenbewertungen[Typ],Berechnungen!AI$5)*Einstellungen!K11,\"\")","v":""},0.08000000000000002,{"$f":"SUMIFS(Einstellungen!E11:K11,Berechnungen!AC8:AI8,\">0\")","v":0.1},{"v":0.8000000000000002,"d":"80%"},2.67,"B-"]
[null,null,{"$f":"IF(Einstellungen!C12=\"\",\"\",Einstellungen!C12)","v":"Mathematik 2"},{"v":0.85,"d":"85%"},{"v":0.95,"d":"95%"},"","","","","","","","","","","","","","","","","","","","","","","",{"$f":"IFERROR(AVERAGEIFS(TblKlassenbewertungen[Bewertung],TblKlassenbewertungen[Kurs],Berechnungen!$C9,TblKlassenbewertungen[Typ],Berechnungen!AC$5)*Einstellungen!E12,\"\")","v":0.1275},{"$f":"IFERROR(AVERAGEIFS(TblKlassenbewertungen[Bewertung],TblKlassenbewertungen[Kurs],Berechnungen!$C9,TblKlassenbewertungen[Typ],Berechnungen!AD$5)*Einstellungen!F12,\"\")","v":""},{"$f":"IFERROR(AVERAGEIFS(TblKlassenbewertungen[Bewertung],TblKlassenbewertungen[Kurs],Berechnungen!$C9,TblKlassenbewertungen[Typ],Berechnungen!AE$5)*Einstellungen!G12,\"\")","v":0.095},{"$f":"IFERROR(AVERAGEIFS(TblKlassenbewertungen[Bewertung],TblKlassenbewertungen[Kurs],Berechnungen!$C9,TblKlassenbewertungen[Typ],Berechnungen!AF$5)*Einstellungen!H12,\"\")","v":""},{"$f":"IFERROR(AVERAGEIFS(TblKlassenbewertungen[Bewertung],TblKlassenbewertungen[Kurs],Berechnungen!$C9,TblKlassenbewertungen[Typ],Berechnungen!AG$5)*Einstellungen!I12,\"\")","v":""},{"$f":"IFERROR(AVERAGEIFS(TblKlassenbewertungen[Bewertung],TblKlassenbewertungen[Kurs],Berechnungen!$C9,TblKlassenbewertungen[Typ],Berechnungen!AH$5)*Einstellungen!J12,\"\")","v":""},{"$f":"IFERROR(AVERAGEIFS(TblKlassenbewertungen[Bewertung],TblKlassenbewertungen[Kurs],Berechnungen!$C9,TblKlassenbewertungen[Typ],Berechnungen!AI$5)*Einstellungen!K12,\"\")","v":""},0.2225,{"$f":"SUMIFS(Einstellungen!E12:K12,Berechnungen!AC9:AI9,\">0\")","v":0.25},{"v":0.89,"d":"89%"},3.33,"B+"]
[null,null,{"$f":"IF(Einstellungen!C13=\"\",\"\",Einstellungen!C13)","v":"Programmierung in Java - Fortgeschrittene"},{"v":0.75,"d":"75%"},"","","","","","","","","","","","","","","","","","","","","","","","",{"$f":"IFERROR(AVERAGEIFS(TblKlassenbewertungen[Bewertung],TblKlassenbewertungen[Kurs],Berechnungen!$C10,TblKlassenbewertungen[Typ],Berechnungen!AC$5)*Einstellungen!E13,\"\")","v":""},{"$f":"IFERROR(AVERAGEIFS(TblKlassenbewertungen[Bewertung],TblKlassenbewertungen[Kurs],Berechnungen!$C10,TblKlassenbewertungen[Typ],Berechnungen!AD$5)*Einstellungen!F13,\"\")","v":""},{"$f":"IFERROR(AVERAGEIFS(TblKlassenbewertungen[Bewertung],TblKlassenbewertungen[Kurs],Berechnungen!$C10,TblKlassenbewertungen[Typ],Berechnungen!AE$5)*Einstellungen!G13,\"\")","v":""},{"$f":"IFERROR(AVERAGEIFS(TblKlassenbewertungen[Bewertung],TblKlassenbewertungen[Kurs],Berechnungen!$C10,TblKlassenbewertungen[Typ],Berechnungen!AF$5)*Einstellungen!H13,\"\")","v":""},{"$f":"IFERROR(AVERAGEIFS(TblKlassenbewertungen[Bewertung],TblKlassenbewertungen[Kurs],Berechnungen!$C10,TblKlassenbewertungen[Typ],Berechnungen!AG$5)*Einstellungen!I13,\"\")","v":0.15000000000000002},{"$f":"IFERROR(AVERAGEIFS(TblKlassenbewertungen[Bewertung],TblKlassenbewertungen[Kurs],Berechnungen!$C10,TblKlassenbewertungen[Typ],Berechnungen!AH$5)*Einstellungen!J13,\"\")","v":""},{"$f":"IFERROR(AVERAGEIFS(TblKlassenbewertungen[Bewertung],TblKlassenbewertungen[Kurs],Berechnungen!$C10,TblKlassenbewertungen[Typ],Berechnungen!AI$5)*Einstellungen!K13,\"\")","v":""},0.15000000000000002,{"$f":"SUMIFS(Einstellungen!E13:K13,Berechnungen!AC10:AI10,\">0\")","v":0.2},{"v":0.7500000000000001,"d":"75%"},2,"C"]
[null,null,{"$f":"IF(Einstellungen!C14=\"\",\"\",Einstellungen!C14)","v":"Spanisch"},{"v":0.5,"d":"50%"},"","","","","","","","","","","","","","","","","","","","","","","","",{"$f":"IFERROR(AVERAGEIFS(TblKlassenbewertungen[Bewertung],TblKlassenbewertungen[Kurs],Berechnungen!$C11,TblKlassenbewertungen[Typ],Berechnungen!AC$5)*Einstellungen!E14,\"\")","v":0.05},{"$f":"IFERROR(AVERAGEIFS(TblKlassenbewertungen[Bewertung],TblKlassenbewertungen[Kurs],Berechnungen!$C11,TblKlassenbewertungen[Typ],Berechnungen!AD$5)*Einstellungen!F14,\"\")","v":""},{"$f":"IFERROR(AVERAGEIFS(TblKlassenbewertungen[Bewertung],TblKlassenbewertungen[Kurs],Berechnungen!$C11,TblKlassenbewertungen[Typ],Berechnungen!AE$5)*Einstellungen!G14,\"\")","v":""},{"$f":"IFERROR(AVERAGEIFS(TblKlassenbewertungen[Bewertung],TblKlassenbewertungen[Kurs],Berechnungen!$C11,TblKlassenbewertungen[Typ],Berechnungen!AF$5)*Einstellungen!H14,\"\")","v":""},{"$f":"IFERROR(AVERAGEIFS(TblKlassenbewertungen[Bewertung],TblKlassenbewertungen[Kurs],Berechnungen!$C11,TblKlassenbewertungen[Typ],Berechnungen!AG$5)*Einstellungen!I14,\"\")","v":""},{"$f":"IFERROR(AVERAGEIFS(TblKlassenbewertungen[Bewertung],TblKlassenbewertungen[Kurs],Berechnungen!$C11,TblKlassenbewertungen[Typ],Berechnungen!AH$5)*Einstellungen!J14,\"\")","v":""},{"$f":"IFERROR(AVERAGEIFS(TblKlassenbewertungen[Bewertung],TblKlassenbewertungen[Kurs],Berechnungen!$C11,TblKlassenbewertungen[Typ],Berechnungen!AI$5)*Einstellungen!K14,\"\")","v":""},0.05,{"$f":"SUMIFS(Einstellungen!E14:K14,Berechnungen!AC11:AI11,\">0\")","v":0.1},{"v":0.5,"d":"50%"},0,"F"]
[null,null,{"$f":"IF(Einstellungen!C15=\"\",\"\",Einstellungen!C15)","v":"Freies Schreiben"},{"v":0.95,"d":"95%"},"","","","","","","","","","","","","","","","","","","","","","","","",{"$f":"IFERROR(AVERAGEIFS(TblKlassenbewertungen[Bewertung],TblKlassenbewertungen[Kurs],Berechnungen!$C12,TblKlassenbewertungen[Typ],Berechnungen!AC$5)*Einstellungen!E15,\"\")","v":""},{"$f":"IFERROR(AVERAGEIFS(TblKlassenbewertungen[Bewertung],TblKlassenbewertungen[Kurs],Berechnungen!$C12,TblKlassenbewertungen[Typ],Berechnungen!AD$5)*Einstellungen!F15,\"\")","v":0.1425},{"$f":"IFERROR(AVERAGEIFS(TblKlassenbewertungen[Bewertung],TblKlassenbewertungen[Kurs],Berechnungen!$C12,TblKlassenbewertungen[Typ],Berechnungen!AE$5)*Einstellungen!G15,\"\")","v":""},{"$f":"IFERROR(AVERAGEIFS(TblKlassenbewertungen[Bewertung],TblKlassenbewertungen[Kurs],Berechnungen!$C12,TblKlassenbewertungen[Typ],Berechnungen!AF$5)*Einstellungen!H15,\"\")","v":""},{"$f":"IFERROR(AVERAGEIFS(TblKlassenbewertungen[Bewertung],TblKlassenbewertungen[Kurs],Berechnungen!$C12,TblKlassenbewertungen[Typ],Berechnungen!AG$5)*Einstellungen!I15,\"\")","v":""},{"$f":"IFERROR(AVERAGEIFS(TblKlassenbewertungen[Bewertung],TblKlassenbewertungen[Kurs],Berechnungen!$C12,TblKlassenbewertungen[Typ],Berechnungen!AH$5)*Einstellungen!J15,\"\")","v":""},{"$f":"IFERROR(AVERAGEIFS(TblKlassenbewertungen[Bewertung],TblKlassenbewertungen[Kurs],Berechnungen!$C12,TblKlassenbewertungen[Typ],Berechnungen!AI$5)*Einstellungen!K15,\"\")","v":""},0.1425,{"$f":"SUMIFS(Einstellungen!E15:K15,Berechnungen!AC12:AI12,\">0\")","v":0.15},{"v":0.95,"d":"95%"},4,"A"]
[null,null,{"$f":"IF(Einstellungen!C16=\"\",\"\",Einstellungen!C16)","v":""},"","","","","","","","","","","","","","","","","","","","","","","","","",{"$f":"IFERROR(AVERAGEIFS(TblKlassenbewertungen[Bewertung],TblKlassenbewertungen[Kurs],Berechnungen!$C13,TblKlassenbewertungen[Typ],Berechnungen!AC$5)*Einstellungen!E16,\"\")","v":""},{"$f":"IFERROR(AVERAGEIFS(TblKlassenbewertungen[Bewertung],TblKlassenbewertungen[Kurs],Berechnungen!$C13,TblKlassenbewertungen[Typ],Berechnungen!AD$5)*Einstellungen!F16,\"\")","v":""},{"$f":"IFERROR(AVERAGEIFS(TblKlassenbewertungen[Bewertung],TblKlassenbewertungen[Kurs],Berechnungen!$C13,TblKlassenbewertungen[Typ],Berechnungen!AE$5)*Einstellungen!G16,\"\")","v":""},{"$f":"IFERROR(AVERAGEIFS(TblKlassenbewertungen[Bewertung],TblKlassenbewertungen[Kurs],Berechnungen!$C13,TblKlassenbewertungen[Typ],Berechnungen!AF$5)*Einstellungen!H16,\"\")","v":""},{"$f":"IFERROR(AVERAGEIFS(TblKlassenbewertungen[Bewertung],TblKlassenbewertungen[Kurs],Berechnungen!$C13,TblKlassenbewertungen[Typ],Berechnungen!AG$5)*Einstellungen!I16,\"\")","v":""},{"$f":"IFERROR(AVERAGEIFS(TblKlassenbewertungen[Bewertung],TblKlassenbewertungen[Kurs],Berechnungen!$C13,TblKlassenbewertungen[Typ],Berechnungen!AH$5)*Einstellungen!J16,\"\")","v":""},{"$f":"IFERROR(AVERAGEIFS(TblKlassenbewertungen[Bewertung],TblKlassenbewertungen[Kurs],Berechnungen!$C13,TblKlassenbewertungen[Typ],Berechnungen!AI$5)*Einstellungen!K16,\"\")","v":""},{"$f":"SUM(AC13:AI13)","v":0},{"$f":"SUMIFS(Einstellungen!E16:K16,Berechnungen!AC13:AI13,\">0\")","v":0},{"$f":"IFERROR(AJ13/AK13,\"\")","v":""},"",""]
[null,null,{"$f":"IF(Einstellungen!C17=\"\",\"\",Einstellungen!C17)","v":""},"","","","","","","","","","","","","","","","","","","","","","","","","",{"$f":"IFERROR(AVERAGEIFS(TblKlassenbewertungen[Bewertung],TblKlassenbewertungen[Kurs],Berechnungen!$C14,TblKlassenbewertungen[Typ],Berechnungen!AC$5)*Einstellungen!E17,\"\")","v":""},{"$f":"IFERROR(AVERAGEIFS(TblKlassenbewertungen[Bewertung],TblKlassenbewertungen[Kurs],Berechnungen!$C14,TblKlassenbewertungen[Typ],Berechnungen!AD$5)*Einstellungen!F17,\"\")","v":""},{"$f":"IFERROR(AVERAGEIFS(TblKlassenbewertungen[Bewertung],TblKlassenbewertungen[Kurs],Berechnungen!$C14,TblKlassenbewertungen[Typ],Berechnungen!AE$5)*Einstellungen!G17,\"\")","v":""},{"$f":"IFERROR(AVERAGEIFS(TblKlassenbewertungen[Bewertung],TblKlassenbewertungen[Kurs],Berechnungen!$C14,TblKlassenbewertungen[Typ],Berechnungen!AF$5)*Einstellungen!H17,\"\")","v":""},{"$f":"IFERROR(AVERAGEIFS(TblKlassenbewertungen[Bewertung],TblKlassenbewertungen[Kurs],Berechnungen!$C14,TblKlassenbewertungen[Typ],Berechnungen!AG$5)*Einstellungen!I17,\"\")","v":""},{"$f":"IFERROR(AVERAGEIFS(TblKlassenbewertungen[Bewertung],TblKlassenbewertungen[Kurs],Berechnungen!$C14,TblKlassenbewertungen[Typ],Berechnungen!AH$5)*Einstellungen!J17,\"\")","v":""},{"$f":"IFERROR(AVERAGEIFS(TblKlassenbewertungen[Bewertung],TblKlassenbewertungen[Kurs],Berechnungen!$C14,TblKlassenbewertungen[Typ],Berechnungen!AI$5)*Einstellungen!K17,\"\")","v":""},0,{"$f":"SUMIFS(Einstellungen!E17:K17,Berechnungen!AC14:AI14,\">0\")","v":0},"","",""]
[null,null,{"$f":"IF(Einstellungen!C18=\"\",\"\",Einstellungen!C18)","v":""},"","","","","","","","","","","","","","","","","","","","","","","","","",{"$f":"IFERROR(AVERAGEIFS(TblKlassenbewertungen[Bewertung],TblKlassenbewertungen[Kurs],Berechnungen!$C15,TblKlassenbewertungen[Typ],Berechnungen!AC$5)*Einstellungen!E18,\"\")","v":""},{"$f":"IFERROR(AVERAGEIFS(TblKlassenbewertungen[Bewertung],TblKlassenbewertungen[Kurs],Berechnungen!$C15,TblKlassenbewertungen[Typ],Berechnungen!AD$5)*Einstellungen!F18,\"\")","v":""},{"$f":"IFERROR(AVERAGEIFS(TblKlassenbewertungen[Bewertung],TblKlassenbewertungen[Kurs],Berechnungen!$C15,TblKlassenbewertungen[Typ],Berechnungen!AE$5)*Einstellungen!G18,\"\")","v":""},{"$f":"IFERROR(AVERAGEIFS(TblKlassenbewertungen[Bewertung],TblKlassenbewertungen[Kurs],Berechnungen!$C15,TblKlassenbewertungen[Typ],Berechnungen!AF$5)*Einstellungen!H18,\"\")","v":""},{"$f":"IFERROR(AVERAGEIFS(TblKlassenbewertungen[Bewertung],TblKlassenbewertungen[Kurs],Berechnungen!$C15,TblKlassenbewertungen[Typ],Berechnungen!AG$5)*Einstellungen!I18,\"\")","v":""},{"$f":"IFERROR(AVERAGEIFS(TblKlassenbewertungen[Bewertung],TblKlassenbewertungen[Kurs],Berechnungen!$C15,TblKlassenbewertungen[Typ],Berechnungen!AH$5)*Einstellungen!J18,\"\")","v":""},{"$f":"IFERROR(AVERAGEIFS(TblKlassenbewertungen[Bewertung],TblKlassenbewertungen[Kurs],Berechnungen!$C15,TblKlassenbewertungen[Typ],Berechnungen!AI$5)*Einstellungen!K18,\"\")","v":""},0,{"$f":"SUMIFS(Einstellungen!E18:K18,Berechnungen!AC15:AI15,\">0\")","v":0},"","",""]
{"$rows_left_out":642}