{"text_format":"3","workbook":"xlsx","n_sheets":3,"sheets":["Schulungsprotokoll","Kursliste","Mitarbeiterinfos"],"not_rendered":{"defined_names":13},"read":"whole","date_system":"1900"}

{"sheet":"Schulungsprotokoll","index":0,"n_rows":23,"n_cols":9,"rows_kept":23}
[]
[]
[null,null,"SCHULUNGSPROTOKOLL"]
{"$rows_empty":8}
[null,null,"DATUM DER SCHULUNG","Name","KURS","KURSLEITER","TEILGENOMMEN","BESTANDEN/DURCHGEFALLEN","NOTIZEN"]
[null,null,"2012-06-01","Torsten Arndt","Einführung für neue Mitarbeiter",{"$f":"IF(tblSchulungsProtokoll[[#This Row],[KURS]]=\"\",\"\",IFERROR(VLOOKUP(tblSchulungsProtokoll[[#This Row],[KURS]],tblKursListe[],2,0),\"Not Found\"))","v":"Christian John"},"Ja","Bestanden","Hervorragender Kursleiter."]
[null,null,"2012-06-02","Michael Lange","Einführung für neue Mitarbeiter",{"$f":"IF(tblSchulungsProtokoll[[#This Row],[KURS]]=\"\",\"\",IFERROR(VLOOKUP(tblSchulungsProtokoll[[#This Row],[KURS]],tblKursListe[],2,0),\"Not Found\"))","v":"Christian John"},"Ja","Durchgefallen","Musste die Veranstaltung frühzeitig verlassen, konnte den Kurs nicht abschließen."]
[null,null,"2012-06-03","Robert Wacker","Einführung für neue Mitarbeiter",{"$f":"IF(tblSchulungsProtokoll[[#This Row],[KURS]]=\"\",\"\",IFERROR(VLOOKUP(tblSchulungsProtokoll[[#This Row],[KURS]],tblKursListe[],2,0),\"Not Found\"))","v":"Christian John"},"Ja","Bestanden","Abschließendes Angebot für dieses Quartal."]
[null,null,"2012-06-03","Michael Lange","Einführung für neue Mitarbeiter",{"$f":"IF(tblSchulungsProtokoll[[#This Row],[KURS]]=\"\",\"\",IFERROR(VLOOKUP(tblSchulungsProtokoll[[#This Row],[KURS]],tblKursListe[],2,0),\"Not Found\"))","v":"Christian John"},"Ja","Bestanden","Abschließendes Angebot für dieses Quartal."]
[null,null,"2012-06-04","Michael Lange","Mitarbeitereinsatz",{"$f":"IF(tblSchulungsProtokoll[[#This Row],[KURS]]=\"\",\"\",IFERROR(VLOOKUP(tblSchulungsProtokoll[[#This Row],[KURS]],tblKursListe[],2,0),\"Not Found\"))","v":"Katja Jordan"},"Ja","Bestanden","Erste Angebote für dieses Quartal."]
[null,null,"2012-06-04","Robert Wacker","Mitarbeitereinsatz",{"$f":"IF(tblSchulungsProtokoll[[#This Row],[KURS]]=\"\",\"\",IFERROR(VLOOKUP(tblSchulungsProtokoll[[#This Row],[KURS]],tblKursListe[],2,0),\"Not Found\"))","v":"Katja Jordan"},"Ja","Bestanden","Erste Angebote für dieses Quartal."]
[null,null,"2012-06-04","Robert Wacker","Buchhaltung für Fortgeschrittene",{"$f":"IF(tblSchulungsProtokoll[[#This Row],[KURS]]=\"\",\"\",IFERROR(VLOOKUP(tblSchulungsProtokoll[[#This Row],[KURS]],tblKursListe[],2,0),\"Not Found\"))","v":"Katja Jordan"},"Ja","Bestanden","Teilnahmebeschränkung."]
[null,null,"2012-06-04","Torsten Arndt","Mitarbeitereinsatz",{"$f":"IF(tblSchulungsProtokoll[[#This Row],[KURS]]=\"\",\"\",IFERROR(VLOOKUP(tblSchulungsProtokoll[[#This Row],[KURS]],tblKursListe[],2,0),\"Not Found\"))","v":"Katja Jordan"},"Ja","Bestanden","Erste Angebote für dieses Quartal."]
[null,null,"2012-06-05","Torsten Arndt","Buchhaltung für Fortgeschrittene",{"$f":"IF(tblSchulungsProtokoll[[#This Row],[KURS]]=\"\",\"\",IFERROR(VLOOKUP(tblSchulungsProtokoll[[#This Row],[KURS]],tblKursListe[],2,0),\"Not Found\"))","v":"Katja Jordan"},"Nein","Anstehend","Noch nicht teilgenommen."]
[null,null,"2012-06-05","Michael Lange","Buchhaltung für Experten",{"$f":"IF(tblSchulungsProtokoll[[#This Row],[KURS]]=\"\",\"\",IFERROR(VLOOKUP(tblSchulungsProtokoll[[#This Row],[KURS]],tblKursListe[],2,0),\"Not Found\"))","v":"Christian John"},"Nein","Anstehend","Noch nicht teilgenommen."]
[{"$nulls":5},{"$f":"IF(tblSchulungsProtokoll[[#This Row],[KURS]]=\"\",\"\",IFERROR(VLOOKUP(tblSchulungsProtokoll[[#This Row],[KURS]],tblKursListe[],2,0),\"Not Found\"))","v":""}]

{"sheet":"Kursliste","index":1,"n_rows":10,"n_cols":6,"rows_kept":10}
[]
[]
[null,null,"KURSLISTE"]
[]
[null,null,"TITEL","KURSLEITER","BESCHREIBUNG","STUNDEN"]
[null,null,"Einführung für neue Mitarbeiter","Christian John","Ein Einführungskurs für neue Mitarbeiter. Definiert die Zielsetzungen und Erwartungen der Abteilung sowie Zeitrahmen und Begrenzungen.",2]
[null,null,"Mitarbeitereinsatz","Katja Jordan","Grundlegender Mitarbeitereinsatz wie im Handbuch für Mitarbeiter dargelegt.",1]
[null,null,"Mitarbeitereinsatz","Christian John","Grundlegende Verfahren und Richtlinien für die Buchhaltung",1.5]
[null,null,"Buchhaltung für Fortgeschrittene","Katja Jordan","Fortgeschrittene Verfahren und Richtlinien für die Buchhaltung",2]
[null,null,"Buchhaltung für Experten","Christian John","Professionelle Verfahren und Richtlinien für die Buchhaltung",2]

{"sheet":"Mitarbeiterinfos","index":2,"n_rows":9,"n_cols":5,"rows_kept":9}
[]
[]
[null,null,"MITARBEITERINFOS"]
[]
[null,null,"Name","ABTEILUNG","TITEL"]
[null,null,"Torsten Arndt","Vertrieb","Hauptbuchhalter(in)"]
[null,null,"Michael Lange","Buchhaltung","Buchhalter(in)"]
[null,null,"Robert Wacker","Buchhaltung","Buchhalter(in)"]
[null,null,"Katharina Larsson","Buchhaltung","Buchhalter(in)"]