{"text_format":"3","workbook":"xlsx","n_sheets":3,"sheets":["Dateneingabe","Umsatzbericht","Umsatzprognose"],"not_rendered":{"charts":5,"defined_names":7,"pivot_tables":1},"read":"whole","date_system":"1900"}

{"sheet":"Dateneingabe","index":0,"n_rows":24,"n_cols":17,"rows_kept":24}
[{"$nulls":9},{"$f":"365*2","v":730}]
[null,"MONATLICH DATENEINGABE"]
[{"$nulls":11},"SUMMEN",null,null,"PROGNOSE"]
[]
[null,"DATUM","FIRMA","BETRAG","GEPLANT","KOSTEN","ERTRAG","MONAT","QUARTAL","JAHR","MONAT NR (AUSBLENDEN)","MONAT ","QUARTAL ","JÄHRLICH ","MONAT  ","QUARTAL  ","JAHR  "]
[null,{"$f":"40657+(365*2)","v":"2013-04-23"},"A. Datum Corporation",{"v":6400,"d":"6,400.00 €"},{"v":6200,"d":"6,200.00 €"},{"v":4450,"d":"4,450.00 €"},{"$f":"Dateneingabe!$D6-Dateneingabe!$F6","v":{"v":1950,"d":"1,950.00 €"}},{"$f":"DATE(YEAR(Dateneingabe!$B6),MONTH(Dateneingabe!$B6),1)","v":"2013-04-01"},{"$f":"LOOKUP(MONTH(Dateneingabe!$H6),{1,1;2,1;3,1;4,2;5,2;6,2;7,3;8,3;9,3;10,4;11,4;12,4})","v":{"v":2,"d":"Quartal 2"}},{"$f":"YEAR(Dateneingabe!$B6)","v":2013},{"$f":"MONTH(Dateneingabe!$B6)","v":4},{"$f":"SUMIFS(Dateneingabe!$D$6:$D$24,Dateneingabe!$B$6:$B$24,\">=\"&EOMONTH(Dateneingabe!$B6,-1)+1,Dateneingabe!$B$6:$B$24,\"<=\"&EOMONTH(Dateneingabe!$B6,0))","v":{"v":14600,"d":"14,600.00 €"}},{"$f":"SUMIFS(Dateneingabe!$D$6:$D$24,Dateneingabe!$B$6:$B$24,\">=\"&DATE(YEAR(Dateneingabe!$B6),1,1),Dateneingabe!$B$6:$B$24,\"<=\"&DATE(YEAR(Dateneingabe!$B6),12,31),Dateneingabe!$I$6:$I$24,Dateneingabe!$I6)","v":{"v":50800,"d":"50,800.00 €"}},{"$f":"SUMIFS(Dateneingabe!$D$6:$D$24,Dateneingabe!$B$6:$B$24,\">=\"&DATE(YEAR(Dateneingabe!$B6),1,1),Dateneingabe!$B$6:$B$24,\"<=\"&DATE(YEAR(Dateneingabe!$B6),12,31))","v":{"v":143800,"d":"143,800.00 €"}},{"$f":"IFERROR(TREND($L$6:INDEX($L:$L,ROW(),1),$K$6:INDEX($K:$K,ROW(),1),IF(MONTH(Dateneingabe!$B6)=12,13,MONTH(Dateneingabe!$B6)+1)),\"\")","v":{"v":14600,"d":"14,600.00 €"}},{"$f":"IFERROR(TREND($M$6:INDEX($M:$M,ROW(),1),$I$6:INDEX($I:$I,ROW(),1),IF(Dateneingabe!$I6=4,5,Dateneingabe!$I6+1)),\"\")","v":{"v":50800,"d":"50,800.00 €"}},{"$f":"IFERROR(TREND($N$6:INDEX($N:$N,ROW(),1),$J$6:INDEX($J:$J,ROW(),1),Dateneingabe!$J6+1),\"\")","v":{"v":143800,"d":"143,800.00 €"}}]
[null,{"$f":"40659+(365*2)","v":"2013-04-25"},"Contoso Pharmaceuticals",{"v":8200,"d":"8,200.00 €"},{"v":8000,"d":"8,000.00 €"},{"v":6400,"d":"6,400.00 €"},{"$f":"Dateneingabe!$D7-Dateneingabe!$F7","v":{"v":1800,"d":"1,800.00 €"}},{"$f":"DATE(YEAR(Dateneingabe!$B7),MONTH(Dateneingabe!$B7),1)","v":"2013-04-01"},{"$f":"LOOKUP(MONTH(Dateneingabe!$H7),{1,1;2,1;3,1;4,2;5,2;6,2;7,3;8,3;9,3;10,4;11,4;12,4})","v":{"v":2,"d":"Quartal 2"}},{"$f":"YEAR(Dateneingabe!$B7)","v":2013},{"$f":"MONTH(Dateneingabe!$B7)","v":4},{"$f":"SUMIFS(Dateneingabe!$D$6:$D$24,Dateneingabe!$B$6:$B$24,\">=\"&EOMONTH(Dateneingabe!$B7,-1)+1,Dateneingabe!$B$6:$B$24,\"<=\"&EOMONTH(Dateneingabe!$B7,0))","v":{"v":14600,"d":"14,600.00 €"}},{"$f":"SUMIFS(Dateneingabe!$D$6:$D$24,Dateneingabe!$B$6:$B$24,\">=\"&DATE(YEAR(Dateneingabe!$B7),1,1),Dateneingabe!$B$6:$B$24,\"<=\"&DATE(YEAR(Dateneingabe!$B7),12,31),Dateneingabe!$I$6:$I$24,Dateneingabe!$I7)","v":{"v":50800,"d":"50,800.00 €"}},{"$f":"SUMIFS(Dateneingabe!$D$6:$D$24,Dateneingabe!$B$6:$B$24,\">=\"&DATE(YEAR(Dateneingabe!$B7),1,1),Dateneingabe!$B$6:$B$24,\"<=\"&DATE(YEAR(Dateneingabe!$B7),12,31))","v":{"v":143800,"d":"143,800.00 €"}},{"$f":"IFERROR(TREND($L$6:INDEX($L:$L,ROW(),1),$K$6:INDEX($K:$K,ROW(),1),IF(MONTH(Dateneingabe!$B7)=12,13,MONTH(Dateneingabe!$B7)+1)),\"\")","v":{"v":14600,"d":"14,600.00 €"}},{"$f":"IFERROR(TREND($M$6:INDEX($M:$M,ROW(),1),$I$6:INDEX($I:$I,ROW(),1),IF(Dateneingabe!$I7=4,5,Dateneingabe!$I7+1)),\"\")","v":{"v":50800,"d":"50,800.00 €"}},{"$f":"IFERROR(TREND($N$6:INDEX($N:$N,ROW(),1),$J$6:INDEX($J:$J,ROW(),1),Dateneingabe!$J7+1),\"\")","v":{"v":143800,"d":"143,800.00 €"}}]
[null,{"$f":"40671+(365*2)","v":"2013-05-07"},"Consolidated Messenger",{"v":4400,"d":"4,400.00 €"},{"v":4200,"d":"4,200.00 €"},{"v":2600,"d":"2,600.00 €"},{"$f":"Dateneingabe!$D8-Dateneingabe!$F8","v":{"v":1800,"d":"1,800.00 €"}},{"$f":"DATE(YEAR(Dateneingabe!$B8),MONTH(Dateneingabe!$B8),1)","v":"2013-05-01"},{"$f":"LOOKUP(MONTH(Dateneingabe!$H8),{1,1;2,1;3,1;4,2;5,2;6,2;7,3;8,3;9,3;10,4;11,4;12,4})","v":{"v":2,"d":"Quartal 2"}},{"$f":"YEAR(Dateneingabe!$B8)","v":2013},{"$f":"MONTH(Dateneingabe!$B8)","v":5},{"$f":"SUMIFS(Dateneingabe!$D$6:$D$24,Dateneingabe!$B$6:$B$24,\">=\"&EOMONTH(Dateneingabe!$B8,-1)+1,Dateneingabe!$B$6:$B$24,\"<=\"&EOMONTH(Dateneingabe!$B8,0))","v":{"v":21800,"d":"21,800.00 €"}},{"$f":"SUMIFS(Dateneingabe!$D$6:$D$24,Dateneingabe!$B$6:$B$24,\">=\"&DATE(YEAR(Dateneingabe!$B8),1,1),Dateneingabe!$B$6:$B$24,\"<=\"&DATE(YEAR(Dateneingabe!$B8),12,31),Dateneingabe!$I$6:$I$24,Dateneingabe!$I8)","v":{"v":50800,"d":"50,800.00 €"}},{"$f":"SUMIFS(Dateneingabe!$D$6:$D$24,Dateneingabe!$B$6:$B$24,\">=\"&DATE(YEAR(Dateneingabe!$B8),1,1),Dateneingabe!$B$6:$B$24,\"<=\"&DATE(YEAR(Dateneingabe!$B8),12,31))","v":{"v":143800,"d":"143,800.00 €"}},{"$f":"IFERROR(TREND($L$6:INDEX($L:$L,ROW(),1),$K$6:INDEX($K:$K,ROW(),1),IF(MONTH(Dateneingabe!$B8)=12,13,MONTH(Dateneingabe!$B8)+1)),\"\")","v":{"v":28999.999999999996,"d":"29,000.00 €"}},{"$f":"IFERROR(TREND($M$6:INDEX($M:$M,ROW(),1),$I$6:INDEX($I:$I,ROW(),1),IF(Dateneingabe!$I8=4,5,Dateneingabe!$I8+1)),\"\")","v":{"v":50800,"d":"50,800.00 €"}},{"$f":"IFERROR(TREND($N$6:INDEX($N:$N,ROW(),1),$J$6:INDEX($J:$J,ROW(),1),Dateneingabe!$J8+1),\"\")","v":{"v":143800,"d":"143,800.00 €"}}]
[null,{"$f":"40678+(365*2)","v":"2013-05-14"},"Proseware, Inc.",{"v":5400,"d":"5,400.00 €"},{"v":5500,"d":"5,500.00 €"},{"v":4500,"d":"4,500.00 €"},{"$f":"Dateneingabe!$D9-Dateneingabe!$F9","v":{"v":900,"d":"900.00 €"}},{"$f":"DATE(YEAR(Dateneingabe!$B9),MONTH(Dateneingabe!$B9),1)","v":"2013-05-01"},{"$f":"LOOKUP(MONTH(Dateneingabe!$H9),{1,1;2,1;3,1;4,2;5,2;6,2;7,3;8,3;9,3;10,4;11,4;12,4})","v":{"v":2,"d":"Quartal 2"}},{"$f":"YEAR(Dateneingabe!$B9)","v":2013},{"$f":"MONTH(Dateneingabe!$B9)","v":5},{"$f":"SUMIFS(Dateneingabe!$D$6:$D$24,Dateneingabe!$B$6:$B$24,\">=\"&EOMONTH(Dateneingabe!$B9,-1)+1,Dateneingabe!$B$6:$B$24,\"<=\"&EOMONTH(Dateneingabe!$B9,0))","v":{"v":21800,"d":"21,800.00 €"}},{"$f":"SUMIFS(Dateneingabe!$D$6:$D$24,Dateneingabe!$B$6:$B$24,\">=\"&DATE(YEAR(Dateneingabe!$B9),1,1),Dateneingabe!$B$6:$B$24,\"<=\"&DATE(YEAR(Dateneingabe!$B9),12,31),Dateneingabe!$I$6:$I$24,Dateneingabe!$I9)","v":{"v":50800,"d":"50,800.00 €"}},{"$f":"SUMIFS(Dateneingabe!$D$6:$D$24,Dateneingabe!$B$6:$B$24,\">=\"&DATE(YEAR(Dateneingabe!$B9),1,1),Dateneingabe!$B$6:$B$24,\"<=\"&DATE(YEAR(Dateneingabe!$B9),12,31))","v":{"v":143800,"d":"143,800.00 €"}},{"$f":"IFERROR(TREND($L$6:INDEX($L:$L,ROW(),1),$K$6:INDEX($K:$K,ROW(),1),IF(MONTH(Dateneingabe!$B9)=12,13,MONTH(Dateneingabe!$B9)+1)),\"\")","v":{"v":29000,"d":"29,000.00 €"}},{"$f":"IFERROR(TREND($M$6:INDEX($M:$M,ROW(),1),$I$6:INDEX($I:$I,ROW(),1),IF(Dateneingabe!$I9=4,5,Dateneingabe!$I9+1)),\"\")","v":{"v":50800,"d":"50,800.00 €"}},{"$f":"IFERROR(TREND($N$6:INDEX($N:$N,ROW(),1),$J$6:INDEX($J:$J,ROW(),1),Dateneingabe!$J9+1),\"\")","v":{"v":143800,"d":"143,800.00 €"}}]
[null,{"$f":"40678+(365*2)","v":"2013-05-14"},"Hochschule der Schönen Künste",{"v":5800,"d":"5,800.00 €"},{"v":6000,"d":"6,000.00 €"},{"v":4500,"d":"4,500.00 €"},{"$f":"Dateneingabe!$D10-Dateneingabe!$F10","v":{"v":1300,"d":"1,300.00 €"}},{"$f":"DATE(YEAR(Dateneingabe!$B10),MONTH(Dateneingabe!$B10),1)","v":"2013-05-01"},{"$f":"LOOKUP(MONTH(Dateneingabe!$H10),{1,1;2,1;3,1;4,2;5,2;6,2;7,3;8,3;9,3;10,4;11,4;12,4})","v":{"v":2,"d":"Quartal 2"}},{"$f":"YEAR(Dateneingabe!$B10)","v":2013},{"$f":"MONTH(Dateneingabe!$B10)","v":5},{"$f":"SUMIFS(Dateneingabe!$D$6:$D$24,Dateneingabe!$B$6:$B$24,\">=\"&EOMONTH(Dateneingabe!$B10,-1)+1,Dateneingabe!$B$6:$B$24,\"<=\"&EOMONTH(Dateneingabe!$B10,0))","v":{"v":21800,"d":"21,800.00 €"}},{"$f":"SUMIFS(Dateneingabe!$D$6:$D$24,Dateneingabe!$B$6:$B$24,\">=\"&DATE(YEAR(Dateneingabe!$B10),1,1),Dateneingabe!$B$6:$B$24,\"<=\"&DATE(YEAR(Dateneingabe!$B10),12,31),Dateneingabe!$I$6:$I$24,Dateneingabe!$I10)","v":{"v":50800,"d":"50,800.00 €"}},{"$f":"SUMIFS(Dateneingabe!$D$6:$D$24,Dateneingabe!$B$6:$B$24,\">=\"&DATE(YEAR(Dateneingabe!$B10),1,1),Dateneingabe!$B$6:$B$24,\"<=\"&DATE(YEAR(Dateneingabe!$B10),12,31))","v":{"v":143800,"d":"143,800.00 €"}},{"$f":"IFERROR(TREND($L$6:INDEX($L:$L,ROW(),1),$K$6:INDEX($K:$K,ROW(),1),IF(MONTH(Dateneingabe!$B10)=12,13,MONTH(Dateneingabe!$B10)+1)),\"\")","v":{"v":29000,"d":"29,000.00 €"}},{"$f":"IFERROR(TREND($M$6:INDEX($M:$M,ROW(),1),$I$6:INDEX($I:$I,ROW(),1),IF(Dateneingabe!$I10=4,5,Dateneingabe!$I10+1)),\"\")","v":{"v":50800,"d":"50,800.00 €"}},{"$f":"IFERROR(TREND($N$6:INDEX($N:$N,ROW(),1),$J$6:INDEX($J:$J,ROW(),1),Dateneingabe!$J10+1),\"\")","v":{"v":143800,"d":"143,800.00 €"}}]
[null,{"$f":"40693+(365*2)","v":"2013-05-29"},"Trey Research",{"v":6200,"d":"6,200.00 €"},{"v":6000,"d":"6,000.00 €"},{"v":4500,"d":"4,500.00 €"},{"$f":"Dateneingabe!$D11-Dateneingabe!$F11","v":{"v":1700,"d":"1,700.00 €"}},{"$f":"DATE(YEAR(Dateneingabe!$B11),MONTH(Dateneingabe!$B11),1)","v":"2013-05-01"},{"$f":"LOOKUP(MONTH(Dateneingabe!$H11),{1,1;2,1;3,1;4,2;5,2;6,2;7,3;8,3;9,3;10,4;11,4;12,4})","v":{"v":2,"d":"Quartal 2"}},{"$f":"YEAR(Dateneingabe!$B11)","v":2013},{"$f":"MONTH(Dateneingabe!$B11)","v":5},{"$f":"SUMIFS(Dateneingabe!$D$6:$D$24,Dateneingabe!$B$6:$B$24,\">=\"&EOMONTH(Dateneingabe!$B11,-1)+1,Dateneingabe!$B$6:$B$24,\"<=\"&EOMONTH(Dateneingabe!$B11,0))","v":{"v":21800,"d":"21,800.00 €"}},{"$f":"SUMIFS(Dateneingabe!$D$6:$D$24,Dateneingabe!$B$6:$B$24,\">=\"&DATE(YEAR(Dateneingabe!$B11),1,1),Dateneingabe!$B$6:$B$24,\"<=\"&DATE(YEAR(Dateneingabe!$B11),12,31),Dateneingabe!$I$6:$I$24,Dateneingabe!$I11)","v":{"v":50800,"d":"50,800.00 €"}},{"$f":"SUMIFS(Dateneingabe!$D$6:$D$24,Dateneingabe!$B$6:$B$24,\">=\"&DATE(YEAR(Dateneingabe!$B11),1,1),Dateneingabe!$B$6:$B$24,\"<=\"&DATE(YEAR(Dateneingabe!$B11),12,31))","v":{"v":143800,"d":"143,800.00 €"}},{"$f":"IFERROR(TREND($L$6:INDEX($L:$L,ROW(),1),$K$6:INDEX($K:$K,ROW(),1),IF(MONTH(Dateneingabe!$B11)=12,13,MONTH(Dateneingabe!$B11)+1)),\"\")","v":{"v":29000,"d":"29,000.00 €"}},{"$f":"IFERROR(TREND($M$6:INDEX($M:$M,ROW(),1),$I$6:INDEX($I:$I,ROW(),1),IF(Dateneingabe!$I11=4,5,Dateneingabe!$I11+1)),\"\")","v":{"v":50800,"d":"50,800.00 €"}},{"$f":"IFERROR(TREND($N$6:INDEX($N:$N,ROW(),1),$J$6:INDEX($J:$J,ROW(),1),Dateneingabe!$J11+1),\"\")","v":{"v":143800,"d":"143,800.00 €"}}]
[null,{"$f":"40705+(365*2)","v":"2013-06-10"},"A. Datum Corporation",{"v":6900,"d":"6,900.00 €"},{"v":7500,"d":"7,500.00 €"},{"v":5400,"d":"5,400.00 €"},{"$f":"Dateneingabe!$D12-Dateneingabe!$F12","v":{"v":1500,"d":"1,500.00 €"}},{"$f":"DATE(YEAR(Dateneingabe!$B12),MONTH(Dateneingabe!$B12),1)","v":"2013-06-01"},{"$f":"LOOKUP(MONTH(Dateneingabe!$H12),{1,1;2,1;3,1;4,2;5,2;6,2;7,3;8,3;9,3;10,4;11,4;12,4})","v":{"v":2,"d":"Quartal 2"}},{"$f":"YEAR(Dateneingabe!$B12)","v":2013},{"$f":"MONTH(Dateneingabe!$B12)","v":6},{"$f":"SUMIFS(Dateneingabe!$D$6:$D$24,Dateneingabe!$B$6:$B$24,\">=\"&EOMONTH(Dateneingabe!$B12,-1)+1,Dateneingabe!$B$6:$B$24,\"<=\"&EOMONTH(Dateneingabe!$B12,0))","v":{"v":14400,"d":"14,400.00 €"}},{"$f":"SUMIFS(Dateneingabe!$D$6:$D$24,Dateneingabe!$B$6:$B$24,\">=\"&DATE(YEAR(Dateneingabe!$B12),1,1),Dateneingabe!$B$6:$B$24,\"<=\"&DATE(YEAR(Dateneingabe!$B12),12,31),Dateneingabe!$I$6:$I$24,Dateneingabe!$I12)","v":{"v":50800,"d":"50,800.00 €"}},{"$f":"SUMIFS(Dateneingabe!$D$6:$D$24,Dateneingabe!$B$6:$B$24,\">=\"&DATE(YEAR(Dateneingabe!$B12),1,1),Dateneingabe!$B$6:$B$24,\"<=\"&DATE(YEAR(Dateneingabe!$B12),12,31))","v":{"v":143800,"d":"143,800.00 €"}},{"$f":"IFERROR(TREND($L$6:INDEX($L:$L,ROW(),1),$K$6:INDEX($K:$K,ROW(),1),IF(MONTH(Dateneingabe!$B12)=12,13,MONTH(Dateneingabe!$B12)+1)),\"\")","v":{"v":21600.000000000004,"d":"21,600.00 €"}},{"$f":"IFERROR(TREND($M$6:INDEX($M:$M,ROW(),1),$I$6:INDEX($I:$I,ROW(),1),IF(Dateneingabe!$I12=4,5,Dateneingabe!$I12+1)),\"\")","v":{"v":50800,"d":"50,800.00 €"}},{"$f":"IFERROR(TREND($N$6:INDEX($N:$N,ROW(),1),$J$6:INDEX($J:$J,ROW(),1),Dateneingabe!$J12+1),\"\")","v":{"v":143800,"d":"143,800.00 €"}}]
[null,{"$f":"40716+(365*2)","v":"2013-06-21"},"Contoso Pharmaceuticals",{"v":7500,"d":"7,500.00 €"},{"v":7200,"d":"7,200.00 €"},{"v":6500,"d":"6,500.00 €"},{"$f":"Dateneingabe!$D13-Dateneingabe!$F13","v":{"v":1000,"d":"1,000.00 €"}},{"$f":"DATE(YEAR(Dateneingabe!$B13),MONTH(Dateneingabe!$B13),1)","v":"2013-06-01"},{"$f":"LOOKUP(MONTH(Dateneingabe!$H13),{1,1;2,1;3,1;4,2;5,2;6,2;7,3;8,3;9,3;10,4;11,4;12,4})","v":{"v":2,"d":"Quartal 2"}},{"$f":"YEAR(Dateneingabe!$B13)","v":2013},{"$f":"MONTH(Dateneingabe!$B13)","v":6},{"$f":"SUMIFS(Dateneingabe!$D$6:$D$24,Dateneingabe!$B$6:$B$24,\">=\"&EOMONTH(Dateneingabe!$B13,-1)+1,Dateneingabe!$B$6:$B$24,\"<=\"&EOMONTH(Dateneingabe!$B13,0))","v":{"v":14400,"d":"14,400.00 €"}},{"$f":"SUMIFS(Dateneingabe!$D$6:$D$24,Dateneingabe!$B$6:$B$24,\">=\"&DATE(YEAR(Dateneingabe!$B13),1,1),Dateneingabe!$B$6:$B$24,\"<=\"&DATE(YEAR(Dateneingabe!$B13),12,31),Dateneingabe!$I$6:$I$24,Dateneingabe!$I13)","v":{"v":50800,"d":"50,800.00 €"}},{"$f":"SUMIFS(Dateneingabe!$D$6:$D$24,Dateneingabe!$B$6:$B$24,\">=\"&DATE(YEAR(Dateneingabe!$B13),1,1),Dateneingabe!$B$6:$B$24,\"<=\"&DATE(YEAR(Dateneingabe!$B13),12,31))","v":{"v":143800,"d":"143,800.00 €"}},{"$f":"IFERROR(TREND($L$6:INDEX($L:$L,ROW(),1),$K$6:INDEX($K:$K,ROW(),1),IF(MONTH(Dateneingabe!$B13)=12,13,MONTH(Dateneingabe!$B13)+1)),\"\")","v":{"v":17950,"d":"17,950.00 €"}},{"$f":"IFERROR(TREND($M$6:INDEX($M:$M,ROW(),1),$I$6:INDEX($I:$I,ROW(),1),IF(Dateneingabe!$I13=4,5,Dateneingabe!$I13+1)),\"\")","v":{"v":50800,"d":"50,800.00 €"}},{"$f":"IFERROR(TREND($N$6:INDEX($N:$N,ROW(),1),$J$6:INDEX($J:$J,ROW(),1),Dateneingabe!$J13+1),\"\")","v":{"v":143800,"d":"143,800.00 €"}}]
[null,{"$f":"40731+(365*2)","v":"2013-07-06"},"Consolidated Messenger",{"v":8700,"d":"8,700.00 €"},{"v":8500,"d":"8,500.00 €"},{"v":7250,"d":"7,250.00 €"},{"$f":"Dateneingabe!$D14-Dateneingabe!$F14","v":{"v":1450,"d":"1,450.00 €"}},{"$f":"DATE(YEAR(Dateneingabe!$B14),MONTH(Dateneingabe!$B14),1)","v":"2013-07-01"},{"$f":"LOOKUP(MONTH(Dateneingabe!$H14),{1,1;2,1;3,1;4,2;5,2;6,2;7,3;8,3;9,3;10,4;11,4;12,4})","v":{"v":3,"d":"Quartal 3"}},{"$f":"YEAR(Dateneingabe!$B14)","v":2013},{"$f":"MONTH(Dateneingabe!$B14)","v":7},{"$f":"SUMIFS(Dateneingabe!$D$6:$D$24,Dateneingabe!$B$6:$B$24,\">=\"&EOMONTH(Dateneingabe!$B14,-1)+1,Dateneingabe!$B$6:$B$24,\"<=\"&EOMONTH(Dateneingabe!$B14,0))","v":{"v":8700,"d":"8,700.00 €"}},{"$f":"SUMIFS(Dateneingabe!$D$6:$D$24,Dateneingabe!$B$6:$B$24,\">=\"&DATE(YEAR(Dateneingabe!$B14),1,1),Dateneingabe!$B$6:$B$24,\"<=\"&DATE(YEAR(Dateneingabe!$B14),12,31),Dateneingabe!$I$6:$I$24,Dateneingabe!$I14)","v":{"v":49100,"d":"49,100.00 €"}},{"$f":"SUMIFS(Dateneingabe!$D$6:$D$24,Dateneingabe!$B$6:$B$24,\">=\"&DATE(YEAR(Dateneingabe!$B14),1,1),Dateneingabe!$B$6:$B$24,\"<=\"&DATE(YEAR(Dateneingabe!$B14),12,31))","v":{"v":143800,"d":"143,800.00 €"}},{"$f":"IFERROR(TREND($L$6:INDEX($L:$L,ROW(),1),$K$6:INDEX($K:$K,ROW(),1),IF(MONTH(Dateneingabe!$B14)=12,13,MONTH(Dateneingabe!$B14)+1)),\"\")","v":{"v":10776.470588235294,"d":"10,776.47 €"}},{"$f":"IFERROR(TREND($M$6:INDEX($M:$M,ROW(),1),$I$6:INDEX($I:$I,ROW(),1),IF(Dateneingabe!$I14=4,5,Dateneingabe!$I14+1)),\"\")","v":{"v":47400,"d":"47,400.00 €"}},{"$f":"IFERROR(TREND($N$6:INDEX($N:$N,ROW(),1),$J$6:INDEX($J:$J,ROW(),1),Dateneingabe!$J14+1),\"\")","v":{"v":143800,"d":"143,800.00 €"}}]
[null,{"$f":"40761+(365*2)","v":"2013-08-05"},"Proseware, Inc.",{"v":8500,"d":"8,500.00 €"},{"v":8300,"d":"8,300.00 €"},{"v":7100,"d":"7,100.00 €"},{"$f":"Dateneingabe!$D15-Dateneingabe!$F15","v":{"v":1400,"d":"1,400.00 €"}},{"$f":"DATE(YEAR(Dateneingabe!$B15),MONTH(Dateneingabe!$B15),1)","v":"2013-08-01"},{"$f":"LOOKUP(MONTH(Dateneingabe!$H15),{1,1;2,1;3,1;4,2;5,2;6,2;7,3;8,3;9,3;10,4;11,4;12,4})","v":{"v":3,"d":"Quartal 3"}},{"$f":"YEAR(Dateneingabe!$B15)","v":2013},{"$f":"MONTH(Dateneingabe!$B15)","v":8},{"$f":"SUMIFS(Dateneingabe!$D$6:$D$24,Dateneingabe!$B$6:$B$24,\">=\"&EOMONTH(Dateneingabe!$B15,-1)+1,Dateneingabe!$B$6:$B$24,\"<=\"&EOMONTH(Dateneingabe!$B15,0))","v":{"v":16400,"d":"16,400.00 €"}},{"$f":"SUMIFS(Dateneingabe!$D$6:$D$24,Dateneingabe!$B$6:$B$24,\">=\"&DATE(YEAR(Dateneingabe!$B15),1,1),Dateneingabe!$B$6:$B$24,\"<=\"&DATE(YEAR(Dateneingabe!$B15),12,31),Dateneingabe!$I$6:$I$24,Dateneingabe!$I15)","v":{"v":49100,"d":"49,100.00 €"}},{"$f":"SUMIFS(Dateneingabe!$D$6:$D$24,Dateneingabe!$B$6:$B$24,\">=\"&DATE(YEAR(Dateneingabe!$B15),1,1),Dateneingabe!$B$6:$B$24,\"<=\"&DATE(YEAR(Dateneingabe!$B15),12,31))","v":{"v":143800,"d":"143,800.00 €"}},{"$f":"IFERROR(TREND($L$6:INDEX($L:$L,ROW(),1),$K$6:INDEX($K:$K,ROW(),1),IF(MONTH(Dateneingabe!$B15)=12,13,MONTH(Dateneingabe!$B15)+1)),\"\")","v":{"v":12455.862068965516,"d":"12,455.86 €"}},{"$f":"IFERROR(TREND($M$6:INDEX($M:$M,ROW(),1),$I$6:INDEX($I:$I,ROW(),1),IF(Dateneingabe!$I15=4,5,Dateneingabe!$I15+1)),\"\")","v":{"v":47400,"d":"47,400.00 €"}},{"$f":"IFERROR(TREND($N$6:INDEX($N:$N,ROW(),1),$J$6:INDEX($J:$J,ROW(),1),Dateneingabe!$J15+1),\"\")","v":{"v":143800,"d":"143,800.00 €"}}]
{"$rows_left_out":10}
{"sheet":"Umsatzbericht","index":1,"n_rows":28,"n_cols":6,"rows_kept":28}
[]
[null,"MONATLICH UMSATZBERICHT"]
[]
[]
[null,"JAHR","QUARTAL","MONAT","FIRMA","Summe von BETRAG"]
[null,2013,{"v":2,"d":"Quartal 2"},"2013-04-01","A. Datum Corporation",{"v":6400,"d":"6,400.00 €"}]
[{"$nulls":4},"Contoso Pharmaceuticals",{"v":8200,"d":"8,200.00 €"}]
[{"$nulls":3},"2013-05-01","Consolidated Messenger",{"v":4400,"d":"4,400.00 €"}]
[{"$nulls":4},"Proseware, Inc.",{"v":5400,"d":"5,400.00 €"}]
[{"$nulls":4},"Hochschule der Schönen Künste",{"v":5800,"d":"5,800.00 €"}]
[{"$nulls":4},"Trey Research",{"v":6200,"d":"6,200.00 €"}]
[{"$nulls":3},"2013-06-01","A. Datum Corporation",{"v":6900,"d":"6,900.00 €"}]
[{"$nulls":4},"Contoso Pharmaceuticals",{"v":7500,"d":"7,500.00 €"}]
[null,null,"Quartal 2 Ergebnis",null,null,{"v":50800,"d":"50,800.00 €"}]
[null,null,{"v":3,"d":"Quartal 3"},"2013-07-01","Consolidated Messenger",{"v":8700,"d":"8,700.00 €"}]
{"$rows_left_out":14}
{"sheet":"Umsatzprognose","index":2,"n_rows":43,"n_cols":10,"rows_kept":43}
[]
[null,"MONATLICH UMSATZPROGNOSE"]
[null,{"$f":"\"Aktuelles Datum: \"&UPPER(TEXT(TODAY(),\"T MMM, JJJJ\"))","v":"Aktuelles Datum: 13 SEP, 2012"},null,{"$f":"--TRIM(RIGHT(B3,LEN(B3)-FIND(\":\",B3)))","v":"2012-09-13"}]
[]
[null,"DIESER MONAT","IST","PLAN","ABWEICHUNG","%","IST JAHR BIS HEUTE","PLAN JAHR BIS HEUTE","ABWEICHUNG JAHR BIS HEUTE","JAHR BIS HEUTE IN %"]
[null,"Menge",{"$f":"COUNTIF(Dateneingabe!$B$6:$B$24,\">=\"&DATE(fJahr,MONTH(fDatum),1))-COUNTIF(Dateneingabe!$B$6:$B$24,\">\"&EOMONTH(fDatum,0))","v":0},{"$nulls":3},{"$f":"COUNTIF(Dateneingabe!$B$6:$B$24,\"<=\"&EOMONTH(fDatum,0))","v":0}]
[null,"Umsatz",{"$f":"SUMIF(Dateneingabe!$B$6:$B$24,\">=\"&DATE(fJahr,MONTH(fDatum),1),Dateneingabe!$D$6:$D$24)-SUMIF(Dateneingabe!$B$6:$B$24,\">\"&EOMONTH(fDatum,0),Dateneingabe!$D$6:$D$24)","v":{"v":0,"d":"0.00 €"}},{"$f":"SUMIF(Dateneingabe!$B$6:$B$24,\">=\"&DATE(fJahr,MONTH(fDatum),1),Dateneingabe!$E$6:$E$24)-SUMIF(Dateneingabe!$B$6:$B$24,\">\"&EOMONTH(fDatum,0),Dateneingabe!$E$6:$E$24)","v":{"v":0,"d":"0.00 €"}},{"$f":"D7-C7","v":{"v":0,"d":"0.00 €"}},{"$f":"IFERROR(D7/C7,\"-\")","v":"-"},{"$f":"SUMIF(Dateneingabe!$B$6:$B$24,\"<=\"&EOMONTH(fDatum,0),Dateneingabe!$D$6:$D$24)","v":{"v":0,"d":"0.00 €"}},{"$f":"SUMIF(Dateneingabe!$B$6:$B$24,\"<=\"&EOMONTH(fDatum,0),Dateneingabe!$E$6:$E$24)","v":{"v":0,"d":"0.00 €"}},{"$f":"H7-G7","v":{"v":0,"d":"0.00 €"}},{"$f":"IFERROR(H7/G7,\"\")","v":""}]
[null,"Erträge",{"$f":"(SUMIF(Dateneingabe!$B$6:$B$24,\">=\"&DATE(fJahr,MONTH(fDatum),1),Dateneingabe!$D$6:$D$24)-SUMIF(Dateneingabe!$B$6:$B$24,\">\"&EOMONTH(fDatum,0),Dateneingabe!$D$6:$D$24))-(SUMIF(Dateneingabe!$B$6:$B$24,\">=\"&DATE(fJahr,MONTH(fDatum),1),Dateneingabe!$F$6:$F$24)-SUMIF(Dateneingabe!$B$6:$B$24,\">\"&EOMONTH(fDatum,0),Dateneingabe!$F$6:$F$24))","v":{"v":0,"d":"0.00 €"}},{"$f":"(SUMIF(Dateneingabe!$B$6:$B$24,\">=\"&DATE(fJahr,MONTH(fDatum),1),Dateneingabe!$E$6:$E$24)-SUMIF(Dateneingabe!$B$6:$B$24,\">\"&EOMONTH(fDatum,0),Dateneingabe!$E$6:$E$24))-(SUMIF(Dateneingabe!$B$6:$B$24,\">=\"&DATE(fJahr,MONTH(fDatum),1),Dateneingabe!$F$6:$F$24)-SUMIF(Dateneingabe!$B$6:$B$24,\">\"&EOMONTH(fDatum,0),Dateneingabe!$F$6:$F$24))","v":{"v":0,"d":"0.00 €"}},{"$f":"D8-C8","v":{"v":0,"d":"0.00 €"}},{"$f":"IFERROR(D8/C8,\"-\")","v":"-"},{"$f":"SUMIF(Dateneingabe!$B$6:$B$24,\"<=\"&EOMONTH(fDatum,0),Dateneingabe!$F$6:$F$24)","v":{"v":0,"d":"0.00 €"}},{"$f":"SUMIF(Dateneingabe!$B$6:$B$24,\"<=\"&EOMONTH(fDatum,0),Dateneingabe!$F$6:$F$24)","v":{"v":0,"d":"0.00 €"}},{"$f":"H8-G8","v":{"v":0,"d":"0.00 €"}},{"$f":"IFERROR(H8/G8,\"\")","v":""}]
[null,"Gewinnspanne",{"$f":"IFERROR(C8/C7,\"-\")","v":"-"},{"$f":"IFERROR(D8/D7,\"-\")","v":"-"},null,{"$f":"IFERROR(F8/F7,\"-\")","v":"-"},{"$f":"IFERROR(G8/G7,\"\")","v":""},{"$f":"IFERROR(H8/H7,\"\")","v":""},null,{"$f":"IFERROR(J8/J7,\"\")","v":""}]
[null,"Anzahl Aufträge",{"$f":"COUNTIF(Dateneingabe!$B$6:$B$24,\">=\"&DATE(fJahr,MONTH(fDatum),1))-COUNTIF(Dateneingabe!$B$6:$B$24,\">\"&EOMONTH(fDatum,0))","v":0},{"$nulls":3},{"$f":"COUNTIF(Dateneingabe!$B$6:$B$24,\">\"&EOMONTH(fDatum,0))","v":19}]
[null,"Durchschnittlicher Auftragswert",{"$f":"IFERROR(C7/C10,\"-\")","v":"-"},{"$nulls":3},{"$f":"IFERROR(G7/G10,\"-\")","v":{"v":0,"d":"0.00 €"}}]
[]
[null,"PROGNOSE",null,"NÄCHSTER MONAT",null,"NÄCHSTES QUARTAL",null,null,"NÄCHSTES JAHR"]
[null,"Umsatz",null,{"$f":"TREND(tblDaten[[MONAT ]],tblDaten[MONAT NR (AUSBLENDEN)],IF(MONTH(fDatum)=12,13,MONTH(fDatum)+1))","v":{"v":19451.90355329949,"d":"19,451.90 €"}},null,{"$f":"TREND(tblDaten[[QUARTAL ]],tblDaten[MONAT NR (AUSBLENDEN)],IF(MONTH(fDatum)=12,13,MONTH(fDatum)+1))","v":{"v":46098.98477157361,"d":"46,098.98 €"}},null,null,{"$f":"TREND(tblDaten[[JÄHRLICH ]],tblDaten[MONAT NR (AUSBLENDEN)],IF(MONTH(fDatum)=12,13,MONTH(fDatum)+1))","v":{"v":143800,"d":"143,800.00 €"}}]
[]
{"$rows_left_out":10}