{"text_format":"3","workbook":"xlsx","n_sheets":2,"sheets":["Arbeitszeittabelle Mitarbeiter","Wochentag_Suche"],"not_rendered":{"defined_names":27},"read":"whole","date_system":"1900"}

{"sheet":"Arbeitszeittabelle Mitarbeiter","index":0,"n_rows":36,"n_cols":26,"rows_kept":36,"merged":[[0,1,2,4],[0,5,2,9],[0,10,2,14],[0,15,3,23],[0,24,3,24],[3,1,3,3],[3,5,3,9],[3,10,3,14],[4,1,6,3],[4,4,6,6],[5,14,7,14],[5,22,7,22],[5,23,7,23],[5,24,7,24],[21,1,21,6],[22,1,23,3],[22,4,23,6],[23,14,24,14],[23,22,24,22],[23,23,24,23],[23,24,24,24],[32,1,32,6],[32,24,33,24],[32,25,33,25],[33,1,33,6],[34,1,34,6],[35,1,35,3],[35,4,35,5],[35,6,35,7],[35,8,35,14],[35,15,35,16],[35,17,35,23]]}
[null,"ARBEITSZEITTABELLE FÜR BETRIEBSMITARBEITER",{"$nulls":3},"Mitarbeitername",{"$nulls":9},"\"Ja\" in Zelle rechts auswählen, wenn \nÜberstundenautorisierung erforderlich ist"]
[]
[]
[null,"Enddatum der Lohnbuchhaltung",null,null,{"$f":"V7","v":"2025-06-14"},"Mitarbeiternummer"]
[null,"REGULÄRE ARBEITSSTUNDEN:",null,null,"Datum:"]
[{"$nulls":14},"Summe\nWoche 1\nRegulär",{"$nulls":7},"Summe\nWoche 2\nRegulär","Gesamtzahl\nregulärer\nArbeitsstunden","Zahlungscode\nnur für\nLohnbuchhaltung"]
[{"$nulls":7},"2025-06-01",{"$f":"Tag_Eins+1","v":"2025-06-02"},{"$f":"Tag_Eins+2","v":"2025-06-03"},{"$f":"Tag_Eins+3","v":"2025-06-04"},{"$f":"Tag_Eins+4","v":"2025-06-05"},{"$f":"Tag_Eins+5","v":"2025-06-06"},{"$f":"Tag_Eins+6","v":"2025-06-07"},null,{"$f":"Tag_Eins+7","v":"2025-06-08"},{"$f":"Tag_Eins+8","v":"2025-06-09"},{"$f":"Tag_Eins+9","v":"2025-06-10"},{"$f":"Tag_Eins+10","v":"2025-06-11"},{"$f":"Tag_Eins+11","v":"2025-06-12"},{"$f":"Tag_Eins+12","v":"2025-06-13"},{"$f":"Tag_Eins+13","v":"2025-06-14"}]
[null,"Vorgang","Ort","AA-Nr.","Arbeitsbeschreibung","Position","Pos.-Nr.",{"$f":"VLOOKUP(WEEKDAY(Tag_Eins),'Wochentag_Suche'!$B$2:$C$8,2)","v":"So"},{"$f":"VLOOKUP(WEEKDAY(I7),'Wochentag_Suche'!$B$2:$C$8,2)","v":"Mo"},{"$f":"VLOOKUP(WEEKDAY(J7),'Wochentag_Suche'!$B$2:$C$8,2)","v":"Di"},{"$f":"VLOOKUP(WEEKDAY(K7),'Wochentag_Suche'!$B$2:$C$8,2)","v":"Mi"},{"$f":"VLOOKUP(WEEKDAY(L7),'Wochentag_Suche'!$B$2:$C$8,2)","v":"Do"},{"$f":"VLOOKUP(WEEKDAY(M7),'Wochentag_Suche'!$B$2:$C$8,2)","v":"Fr"},{"$f":"VLOOKUP(WEEKDAY(N7),'Wochentag_Suche'!$B$2:$C$8,2)","v":"Sa"},null,{"$f":"VLOOKUP(WEEKDAY(P7),'Wochentag_Suche'!$B$2:$C$8,2)","v":"So"},{"$f":"VLOOKUP(WEEKDAY(Q7),'Wochentag_Suche'!$B$2:$C$8,2)","v":"Mo"},{"$f":"VLOOKUP(WEEKDAY(R7),'Wochentag_Suche'!$B$2:$C$8,2)","v":"Di"},{"$f":"VLOOKUP(WEEKDAY(S7),'Wochentag_Suche'!$B$2:$C$8,2)","v":"Mi"},{"$f":"VLOOKUP(WEEKDAY(T7),'Wochentag_Suche'!$B$2:$C$8,2)","v":"Do"},{"$f":"VLOOKUP(WEEKDAY(U7),'Wochentag_Suche'!$B$2:$C$8,2)","v":"Fr"},{"$f":"VLOOKUP(WEEKDAY(V7),'Wochentag_Suche'!$B$2:$C$8,2)","v":"Sa"}]
[{"$nulls":14},{"$f":"SUM(H9:N9)","v":{"v":0,"d":"0.00"}},{"$nulls":7},{"$f":"SUM(P9:V9)","v":{"v":0,"d":"0.00"}},{"$f":"O9+W9","v":{"v":0,"d":"0.00"}}]
[{"$nulls":14},{"v":0,"d":"0.00"},{"$nulls":7},{"v":0,"d":"0.00"},{"v":0,"d":"0.00"}]
[{"$nulls":14},{"v":0,"d":"0.00"},{"$nulls":7},{"v":0,"d":"0.00"},{"v":0,"d":"0.00"}]
[{"$nulls":14},{"v":0,"d":"0.00"},{"$nulls":7},{"v":0,"d":"0.00"},{"v":0,"d":"0.00"}]
[{"$nulls":14},{"v":0,"d":"0.00"},{"$nulls":7},{"v":0,"d":"0.00"},{"v":0,"d":"0.00"}]
[{"$nulls":14},{"v":0,"d":"0.00"},{"$nulls":7},{"v":0,"d":"0.00"},{"v":0,"d":"0.00"}]
[{"$nulls":14},{"v":0,"d":"0.00"},{"$nulls":7},{"v":0,"d":"0.00"},{"v":0,"d":"0.00"}]
[{"$nulls":14},{"$f":"SUM(H16:N16)","v":{"v":0,"d":"0.00"}},{"$nulls":7},{"$f":"SUM(P16:V16)","v":{"v":0,"d":"0.00"}},{"$f":"O16+W16","v":{"v":0,"d":"0.00"}}]
[{"$nulls":14},{"v":0,"d":"0.00"},{"$nulls":7},{"v":0,"d":"0.00"},{"v":0,"d":"0.00"}]
[{"$nulls":14},{"v":0,"d":"0.00"},{"$nulls":7},{"v":0,"d":"0.00"},{"v":0,"d":"0.00"}]
[{"$nulls":14},{"v":0,"d":"0.00"},{"$nulls":7},{"v":0,"d":"0.00"},{"v":0,"d":"0.00"}]
[{"$nulls":14},{"v":0,"d":"0.00"},{"$nulls":7},{"v":0,"d":"0.00"},{"v":0,"d":"0.00"}]
[{"$nulls":14},{"v":0,"d":"0.00"},{"$nulls":7},{"v":0,"d":"0.00"},{"v":0,"d":"0.00"}]
[null,"Reguläre Arbeitsstunden gesamt   ",{"$nulls":5},{"$f":"SUM(H9:H21)","v":{"v":0,"d":"0.00"}},{"v":0,"d":"0.00"},{"v":0,"d":"0.00"},{"v":0,"d":"0.00"},{"v":0,"d":"0.00"},{"v":0,"d":"0.00"},{"v":0,"d":"0.00"},{"v":0,"d":"0.00"},{"v":0,"d":"0.00"},{"$f":"SUM(Q9:Q21)","v":{"v":0,"d":"0.00"}},{"v":0,"d":"0.00"},{"v":0,"d":"0.00"},{"v":0,"d":"0.00"},{"v":0,"d":"0.00"},{"v":0,"d":"0.00"},{"$f":"SUM(W9:W21)","v":{"v":0,"d":"0.00"}},{"$f":"SUM(X9:X21)","v":{"v":0,"d":"0.00"}}]
[null,"ÜBERSTUNDEN:",null,null,"Datum:"]
[{"$nulls":7},{"$f":"Tag_Eins","v":"2025-06-01"},{"$f":"Tag_Eins+1","v":"2025-06-02"},{"$f":"Tag_Eins+2","v":"2025-06-03"},{"$f":"Tag_Eins+3","v":"2025-06-04"},{"$f":"Tag_Eins+4","v":"2025-06-05"},{"$f":"Tag_Eins+5","v":"2025-06-06"},{"$f":"Tag_Eins+6","v":"2025-06-07"},"Woche 1 Überstunden",{"$f":"Tag_Eins+7","v":"2025-06-08"},{"$f":"Tag_Eins+8","v":"2025-06-09"},{"$f":"Tag_Eins+9","v":"2025-06-10"},{"$f":"Tag_Eins+10","v":"2025-06-11"},{"$f":"Tag_Eins+11","v":"2025-06-12"},{"$f":"Tag_Eins+12","v":"2025-06-13"},{"$f":"Tag_Eins+13","v":"2025-06-14"},"Woche 2 Überstunden","Gesamtzahl Überstunden","Überstunden-\ncode"]
[null,"Vorgang","Ort","AA-Nr.","Arbeitsbeschreibung","Position","Pos.-Nr.",{"$f":"VLOOKUP(WEEKDAY(Tag_Eins),'Wochentag_Suche'!$B$2:$C$8,2)","v":"So"},{"$f":"VLOOKUP(WEEKDAY(I24),'Wochentag_Suche'!$B$2:$C$8,2)","v":"Mo"},{"$f":"VLOOKUP(WEEKDAY(J24),'Wochentag_Suche'!$B$2:$C$8,2)","v":"Di"},{"$f":"VLOOKUP(WEEKDAY(K24),'Wochentag_Suche'!$B$2:$C$8,2)","v":"Mi"},{"$f":"VLOOKUP(WEEKDAY(L24),'Wochentag_Suche'!$B$2:$C$8,2)","v":"Do"},{"$f":"VLOOKUP(WEEKDAY(M24),'Wochentag_Suche'!$B$2:$C$8,2)","v":"Fr"},{"$f":"VLOOKUP(WEEKDAY(N24),'Wochentag_Suche'!$B$2:$C$8,2)","v":"Sa"},null,{"$f":"VLOOKUP(WEEKDAY(P24),'Wochentag_Suche'!$B$2:$C$8,2)","v":"So"},{"$f":"VLOOKUP(WEEKDAY(Q24),'Wochentag_Suche'!$B$2:$C$8,2)","v":"Mo"},{"$f":"VLOOKUP(WEEKDAY(R24),'Wochentag_Suche'!$B$2:$C$8,2)","v":"Di"},{"$f":"VLOOKUP(WEEKDAY(S24),'Wochentag_Suche'!$B$2:$C$8,2)","v":"Mi"},{"$f":"VLOOKUP(WEEKDAY(T24),'Wochentag_Suche'!$B$2:$C$8,2)","v":"Do"},{"$f":"VLOOKUP(WEEKDAY(U24),'Wochentag_Suche'!$B$2:$C$8,2)","v":"Fr"},{"$f":"VLOOKUP(WEEKDAY(V24),'Wochentag_Suche'!$B$2:$C$8,2)","v":"Sa"}]
[{"$nulls":14},{"$f":"SUM(H26:N26)","v":{"v":0,"d":"0.00"}},{"$nulls":7},{"$f":"SUM(P26:V26)","v":{"v":0,"d":"0.00"}},{"$f":"O26+W26","v":{"v":0,"d":"0.00"}}]
[{"$nulls":14},{"v":0,"d":"0.00"},{"$nulls":7},{"v":0,"d":"0.00"},{"v":0,"d":"0.00"}]
[{"$nulls":14},{"v":0,"d":"0.00"},{"$nulls":7},{"v":0,"d":"0.00"},{"v":0,"d":"0.00"}]
[{"$nulls":14},{"v":0,"d":"0.00"},{"$nulls":7},{"v":0,"d":"0.00"},{"v":0,"d":"0.00"}]
[{"$nulls":14},{"v":0,"d":"0.00"},{"$nulls":7},{"v":0,"d":"0.00"},{"v":0,"d":"0.00"}]
[{"$nulls":14},{"v":0,"d":"0.00"},{"$nulls":7},{"v":0,"d":"0.00"},{"v":0,"d":"0.00"}]
[{"$nulls":14},{"v":0,"d":"0.00"},{"$nulls":7},{"v":0,"d":"0.00"},{"v":0,"d":"0.00"}]
[null,"Überstunden gesamt     ",{"$nulls":5},{"$f":"SUM(H26:H32)","v":{"v":0,"d":"0.00"}},{"v":0,"d":"0.00"},{"v":0,"d":"0.00"},{"v":0,"d":"0.00"},{"v":0,"d":"0.00"},{"v":0,"d":"0.00"},{"v":0,"d":"0.00"},{"$f":"SUM(O26:O32)","v":{"v":0,"d":"0.00"}},{"v":0,"d":"0.00"},{"v":0,"d":"0.00"},{"v":0,"d":"0.00"},{"v":0,"d":"0.00"},{"v":0,"d":"0.00"},{"v":0,"d":"0.00"},{"v":0,"d":"0.00"},{"$f":"SUM(P33:V33)","v":{"v":0,"d":"0.00"}},{"$f":"SUM(X26:X32)","v":{"v":0,"d":"0.00"}},"Gesamtzahl\nArbeitsstunden\ngeleistet","Gesamtzahl\nArbeitsstunden\nbezahlt"]
[null,"Überstundenvergütung     ",{"$nulls":12},{"$f":"IF(SUM(H34:N34)<=O33,SUM(H34:N34),O33)","v":{"v":0,"d":"0.00"}},{"$nulls":7},{"$f":"IF(SUM(P34:V34)<=W33,SUM(P34:V34),W33)","v":{"v":0,"d":"0.00"}},{"$f":"IF(SUM(Q34:W34)<=X33,SUM(Q34:W34),X33)","v":{"v":0,"d":"0.00"}}]
[null,"Überstunden bezahlt     ",{"$nulls":5},{"$f":"IF(H33>=H34,H33-H34,H33)","v":{"v":0,"d":"0.00"}},{"$f":"IF(I33>=I34,I33-I34,I33)","v":{"v":0,"d":"0.00"}},{"v":0,"d":"0.00"},{"v":0,"d":"0.00"},{"v":0,"d":"0.00"},{"v":0,"d":"0.00"},{"v":0,"d":"0.00"},{"v":0,"d":"0.00"},{"v":0,"d":"0.00"},{"v":0,"d":"0.00"},{"v":0,"d":"0.00"},{"v":0,"d":"0.00"},{"v":0,"d":"0.00"},{"v":0,"d":"0.00"},{"v":0,"d":"0.00"},{"$f":"IF(W33>=W34,W33-W34,W33)","v":{"v":0,"d":"0.00"}},{"$f":"IF(X33>=X34,X33-X34,X33)","v":{"v":0,"d":"0.00"}},{"$f":"$X$22+$X$33","v":{"v":0,"d":"0.00"}},{"$f":"X22+X35","v":{"v":0,"d":"0.00"}}]
[null,"Mitarbeiter ",{"$nulls":4},"Vorgesetzter ",{"$nulls":8},"Vorgesetzter "]

{"sheet":"Wochentag_Suche","index":1,"n_rows":8,"n_cols":3,"rows_kept":8}
[null,"Wochentag\nNummer","Wochentag\nAbkürzung"]
[null,1,"So"]
[null,2,"Mo"]
[null,3,"Di"]
[null,4,"Mi"]
[null,5,"Do"]
[null,6,"Fr"]
[null,7,"Sa"]