{"text_format":"3","workbook":"xlsx","n_sheets":4,"sheets":["Karaktersporing","Din præstation","Indstillinger","Beregninger"],"not_rendered":{"defined_names":3,"comments":1},"read":"whole","date_system":"1900"}

{"sheet":"Karaktersporing","index":0,"n_rows":14,"n_cols":6,"rows_kept":14}
[null,"Angiv dine karakterer her"]
[]
[null,null,"Klasse","Type","Beskrivelse","Karakter"]
[null,null,"Moderne fransk","Lektier","2. verdenskrig - historie",{"v":0.8,"d":"80%"}]
[null,null,"Avanceret programmering i Java","Terminsprøve",null,{"v":0.75,"d":"75%"}]
[null,null,"Spansk","Lektier",null,{"v":0.5,"d":"50%"}]
[null,null,"Teoretisk fysik","Lektier",null,{"v":0.95,"d":"95%"}]
[null,null,"Moderne fransk","Lektier","1. verdenskrig - historie",{"v":0.9,"d":"90%"}]
[null,null,"Moderne fransk","Lektier","Side 30-41",{"v":0.8,"d":"80%"}]
[null,null,"Komposition","Stil","Overbevisende opgave",{"v":0.95,"d":"95%"}]
[null,null,"Matematik 1","Lektier","Side 21 og 26",{"v":0.8,"d":"80%"}]
[null,null,"Matematik 2","Lektier","Side 15 og 18",{"v":0.85,"d":"85%"}]
[null,null,"Matematik 1","Lektier","Side 34-36",{"v":0.8,"d":"80%"}]
[null,null,"Matematik 2","Test",null,{"v":0.95,"d":"95%"}]

{"sheet":"Din præstation","index":1,"n_rows":31,"n_cols":8,"rows_kept":31}
[null,"Din præstation"]
[]
[null,null,"Totaler"]
[null,null,{"$f":"\"Timer: \"&SUM(tblKlasser[Kredittimer])","v":"Timer: 24"},{"$f":"AVERAGE(D7:D31)","v":{"v":0.8104761904761906,"d":"81%"}},{"$f":"AVERAGE(E7:E31)","v":{"v":2.7142857142857144,"d":"2.71"}},{"$f":"SUM(F7:F31)","v":{"v":2.625,"d":"2.63"}},{"$f":"IFERROR(HLOOKUP(D4,l._gennemsnitstilknytning,2),\"\")","v":"B-"}]
[]
[null,null,"Klasser","%","Karaktergennemsnit","Vægtet karaktergennemsnit","Bogstav","Overordnet præstation"]
[null,null,{"$f":"Beregninger!C6","v":"Moderne fransk"},{"$f":"Beregninger!AL6","v":{"v":0.8333333333333334,"d":"83%"}},{"$f":"Beregninger!AM6","v":{"v":3,"d":"3.00"}},{"$f":"IFERROR(E7*Indstillinger!D9/SUM(tblKlasser[Kredittimer]),\"\")","v":{"v":0.375,"d":"0.38"}},{"$f":"Beregninger!AN6","v":"B"}]
[null,null,{"$f":"Beregninger!C7","v":"Teoretisk fysik"},{"$f":"Beregninger!AL7","v":{"v":0.95,"d":"95%"}},{"$f":"Beregninger!AM7","v":{"v":4,"d":"4.00"}},{"$f":"IFERROR(E8*Indstillinger!D10/SUM(tblKlasser[Kredittimer]),\"\")","v":{"v":0.5,"d":"0.50"}},{"$f":"Beregninger!AN7","v":"A"}]
[null,null,{"$f":"Beregninger!C8","v":"Matematik 1"},{"$f":"Beregninger!AL8","v":{"v":0.8000000000000002,"d":"80%"}},{"$f":"Beregninger!AM8","v":2.67},{"$f":"IFERROR(E9*Indstillinger!D11/SUM(tblKlasser[Kredittimer]),\"\")","v":{"v":0.445,"d":"0.45"}},{"$f":"Beregninger!AN8","v":"B-"}]
[null,null,{"$f":"Beregninger!C9","v":"Matematik 2"},{"$f":"Beregninger!AL9","v":{"v":0.89,"d":"89%"}},{"$f":"Beregninger!AM9","v":3.33},{"$f":"IFERROR(E10*Indstillinger!D12/SUM(tblKlasser[Kredittimer]),\"\")","v":{"v":0.555,"d":"0.56"}},{"$f":"Beregninger!AN9","v":"B+"}]
[null,null,{"$f":"Beregninger!C10","v":"Avanceret programmering i Java"},{"$f":"Beregninger!AL10","v":{"v":0.7500000000000001,"d":"75%"}},{"$f":"Beregninger!AM10","v":{"v":2,"d":"2.00"}},{"$f":"IFERROR(E11*Indstillinger!D13/SUM(tblKlasser[Kredittimer]),\"\")","v":{"v":0.4166666666666667,"d":"0.42"}},{"$f":"Beregninger!AN10","v":"C"}]
[null,null,{"$f":"Beregninger!C11","v":"Spansk"},{"$f":"Beregninger!AL11","v":{"v":0.5,"d":"50%"}},{"$f":"Beregninger!AM11","v":{"v":0,"d":"0.00"}},{"$f":"IFERROR(E12*Indstillinger!D14/SUM(tblKlasser[Kredittimer]),\"\")","v":{"v":0,"d":"0.00"}},{"$f":"Beregninger!AN11","v":"F"}]
[null,null,{"$f":"Beregninger!C12","v":"Komposition"},{"$f":"Beregninger!AL12","v":{"v":0.95,"d":"95%"}},{"$f":"Beregninger!AM12","v":{"v":4,"d":"4.00"}},{"$f":"IFERROR(E13*Indstillinger!D15/SUM(tblKlasser[Kredittimer]),\"\")","v":{"v":0.3333333333333333,"d":"0.33"}},{"$f":"Beregninger!AN12","v":"A"}]
[null,null,{"$f":"Beregninger!C13","v":""},{"$f":"Beregninger!AL13","v":""},{"$f":"Beregninger!AM13","v":""},{"$f":"IFERROR(E14*Indstillinger!D16/SUM(tblKlasser[Kredittimer]),\"\")","v":""},{"$f":"Beregninger!AN13","v":""}]
[null,null,{"$f":"Beregninger!C14","v":""},{"$f":"Beregninger!AL14","v":""},{"$f":"Beregninger!AM14","v":""},{"$f":"IFERROR(E15*Indstillinger!D17/SUM(tblKlasser[Kredittimer]),\"\")","v":""},{"$f":"Beregninger!AN14","v":""}]
{"$rows_left_out":17}
{"sheet":"Indstillinger","index":2,"n_rows":15,"n_cols":16,"rows_kept":15,"merged":[[5,2,5,15]]}
[null,"Indstillinger"]
[null,null,"Tilknytning mellem karakterer og karaktergennemsnit"]
[null,null,"Procent",{"v":0,"d":"0%"},{"v":0.6,"d":"60%"},{"v":0.63,"d":"63%"},{"v":0.67,"d":"67%"},{"v":0.7,"d":"70%"},{"v":0.73,"d":"73%"},{"v":0.77,"d":"77%"},{"v":0.8,"d":"80%"},{"v":0.83,"d":"83%"},{"v":0.87,"d":"87%"},{"v":0.9,"d":"90%"},{"v":0.93,"d":"93%"},{"v":0.97,"d":"97%"}]
[null,null,"Karakter (bogstav)","F","D-","D","D+","C-","C","C+","B-","B","B+","A-","A","A+"]
[null,null,"Karaktergennemsnit",0,0.67,1,1.33,1.67,2,2.33,2.67,3,3.33,3.67,4,4]
[]
[null,null,"Vægtede karakterer for op til 25 klasser"]
[null,null,"Lektioner, du tager","Kredittimer","Lektier","Stil","Test","Projekt","Terminsprøve","Endelig eksamen","Andet","% i alt"]
[null,null,"Moderne fransk",{"v":3,"d":"3.0"},{"v":0.1,"d":"10%"},{"v":0.15,"d":"15%"},{"v":0.15,"d":"15%"},{"v":0.1,"d":"10%"},{"v":0.2,"d":"20%"},{"v":0.3,"d":"30%"},null,{"$f":"SUM(tblKlasser[[#This Row],[Lektier]:[Andet]])","v":{"v":1,"d":"100%"}}]
[null,null,"Teoretisk fysik",{"v":3,"d":"3.0"},{"v":0.15,"d":"15%"},{"v":0.15,"d":"15%"},{"v":0.1,"d":"10%"},{"v":0.1,"d":"10%"},{"v":0.15,"d":"15%"},{"v":0.3,"d":"30%"},{"v":0.05,"d":"5%"},{"$f":"SUM(tblKlasser[[#This Row],[Lektier]:[Andet]])","v":{"v":1,"d":"100%"}}]
[null,null,"Matematik 1",{"v":4,"d":"4.0"},{"v":0.1,"d":"10%"},{"v":0.15,"d":"15%"},{"v":0.15,"d":"15%"},{"v":0.1,"d":"10%"},{"v":0.2,"d":"20%"},{"v":0.3,"d":"30%"},null,{"$f":"SUM(tblKlasser[[#This Row],[Lektier]:[Andet]])","v":{"v":1,"d":"100%"}}]
[null,null,"Matematik 2",{"v":4,"d":"4.0"},{"v":0.15,"d":"15%"},{"v":0.15,"d":"15%"},{"v":0.1,"d":"10%"},{"v":0.1,"d":"10%"},{"v":0.15,"d":"15%"},{"v":0.3,"d":"30%"},{"v":0.05,"d":"5%"},{"$f":"SUM(tblKlasser[[#This Row],[Lektier]:[Andet]])","v":{"v":1,"d":"100%"}}]
[null,null,"Avanceret programmering i Java",{"v":5,"d":"5.0"},{"v":0.15,"d":"15%"},{"v":0.15,"d":"15%"},{"v":0.1,"d":"10%"},{"v":0.1,"d":"10%"},{"v":0.2,"d":"20%"},{"v":0.3,"d":"30%"},null,{"$f":"SUM(tblKlasser[[#This Row],[Lektier]:[Andet]])","v":{"v":1,"d":"100%"}}]
[null,null,"Spansk",{"v":3,"d":"3.0"},{"v":0.1,"d":"10%"},{"v":0.15,"d":"15%"},{"v":0.17,"d":"17%"},{"v":0.13,"d":"13%"},{"v":0.2,"d":"20%"},{"v":0.2,"d":"20%"},{"v":0.05,"d":"5%"},{"$f":"SUM(tblKlasser[[#This Row],[Lektier]:[Andet]])","v":{"v":1,"d":"100%"}}]
[null,null,"Komposition",{"v":2,"d":"2.0"},{"v":0.15,"d":"15%"},{"v":0.15,"d":"15%"},{"v":0.12,"d":"12%"},{"v":0.15,"d":"15%"},{"v":0.15,"d":"15%"},{"v":0.25,"d":"25%"},{"v":0.03,"d":"3%"},{"$f":"SUM(tblKlasser[[#This Row],[Lektier]:[Andet]])","v":{"v":1,"d":"100%"}}]
{"$rows_left_out":1}
{"sheet":"Beregninger","index":3,"n_rows":657,"n_cols":40,"rows_kept":657,"hidden":true}
[null,"Beregninger"]
[null,null,"Dette regneark indeholder beregninger for dine karakterer og karaktergennemsnit og skal forblive skjult. Eventuelle ændringer af dette ark kan medføre fejl."]
[]
[null,null,"Aktuel klasseliste","Karakterer (ud af 1)",{"$nulls":24},"Karakterberegning"]
[null,null,"Klasse",1,2,3,4,5,6,7,8,9,10,11,12,13,14,15,16,17,18,19,20,21,22,23,24,25,{"$f":"tblKlasser[[#Headers],[Lektier]]","v":"Lektier"},{"$f":"tblKlasser[[#Headers],[Stil]]","v":"Stil"},{"$f":"tblKlasser[[#Headers],[Test]]","v":"Test"},{"$f":"tblKlasser[[#Headers],[Projekt]]","v":"Projekt"},{"$f":"tblKlasser[[#Headers],[Terminsprøve]]","v":"Terminsprøve"},{"$f":"tblKlasser[[#Headers],[Endelig eksamen]]","v":"Endelig eksamen"},{"$f":"tblKlasser[[#Headers],[Andet]]","v":"Andet"},"I alt","Maksimalt antal point","Samlet %","Karakterpoint","Karakter (bogstav)"]
[null,null,{"$f":"IF(Indstillinger!C9=\"\",\"\",Indstillinger!C9)","v":"Moderne fransk"},{"$f":"IFERROR(INDEX(tblKlassekarakterer[],MATCH($C6:$C30&D$5:AB$5,Beregninger!$C$33:$C$657,0),4),\"\")","v":{"v":0.8,"d":"80%"}},{"v":0.9,"d":"90%"},{"v":0.8,"d":"80%"},"","","","","","","","","","","","","","","","","","","","","","",{"$f":"IFERROR(AVERAGEIFS(tblKlassekarakterer[Karakter],tblKlassekarakterer[Klasse],Beregninger!$C6,tblKlassekarakterer[Type],Beregninger!AC$5)*Indstillinger!E9,\"\")","v":0.08333333333333334},{"$f":"IFERROR(AVERAGEIFS(tblKlassekarakterer[Karakter],tblKlassekarakterer[Klasse],Beregninger!$C6,tblKlassekarakterer[Type],Beregninger!AD$5)*Indstillinger!F9,\"\")","v":""},{"$f":"IFERROR(AVERAGEIFS(tblKlassekarakterer[Karakter],tblKlassekarakterer[Klasse],Beregninger!$C6,tblKlassekarakterer[Type],Beregninger!AE$5)*Indstillinger!G9,\"\")","v":""},{"$f":"IFERROR(AVERAGEIFS(tblKlassekarakterer[Karakter],tblKlassekarakterer[Klasse],Beregninger!$C6,tblKlassekarakterer[Type],Beregninger!AF$5)*Indstillinger!H9,\"\")","v":""},{"$f":"IFERROR(AVERAGEIFS(tblKlassekarakterer[Karakter],tblKlassekarakterer[Klasse],Beregninger!$C6,tblKlassekarakterer[Type],Beregninger!AG$5)*Indstillinger!I9,\"\")","v":""},{"$f":"IFERROR(AVERAGEIFS(tblKlassekarakterer[Karakter],tblKlassekarakterer[Klasse],Beregninger!$C6,tblKlassekarakterer[Type],Beregninger!AH$5)*Indstillinger!J9,\"\")","v":""},{"$f":"IFERROR(AVERAGEIFS(tblKlassekarakterer[Karakter],tblKlassekarakterer[Klasse],Beregninger!$C6,tblKlassekarakterer[Type],Beregninger!AI$5)*Indstillinger!K9,\"\")","v":""},{"$f":"SUM(AC6:AI6)","v":0.08333333333333334},{"$f":"SUMIFS(Indstillinger!E9:K9,Beregninger!AC6:AI6,\">0\")","v":0.1},{"$f":"IFERROR(AJ6/AK6,\"\")","v":{"v":0.8333333333333334,"d":"83%"}},{"$f":"IFERROR(HLOOKUP(AL6,l._gennemsnitstilknytning,3),\"\")","v":3},{"$f":"IFERROR(HLOOKUP(AL6,l._gennemsnitstilknytning,2),\"\")","v":"B"}]
[null,null,{"$f":"IF(Indstillinger!C10=\"\",\"\",Indstillinger!C10)","v":"Teoretisk fysik"},{"v":0.95,"d":"95%"},"","","","","","","","","","","","","","","","","","","","","","","","",{"$f":"IFERROR(AVERAGEIFS(tblKlassekarakterer[Karakter],tblKlassekarakterer[Klasse],Beregninger!$C7,tblKlassekarakterer[Type],Beregninger!AC$5)*Indstillinger!E10,\"\")","v":0.1425},{"$f":"IFERROR(AVERAGEIFS(tblKlassekarakterer[Karakter],tblKlassekarakterer[Klasse],Beregninger!$C7,tblKlassekarakterer[Type],Beregninger!AD$5)*Indstillinger!F10,\"\")","v":""},{"$f":"IFERROR(AVERAGEIFS(tblKlassekarakterer[Karakter],tblKlassekarakterer[Klasse],Beregninger!$C7,tblKlassekarakterer[Type],Beregninger!AE$5)*Indstillinger!G10,\"\")","v":""},{"$f":"IFERROR(AVERAGEIFS(tblKlassekarakterer[Karakter],tblKlassekarakterer[Klasse],Beregninger!$C7,tblKlassekarakterer[Type],Beregninger!AF$5)*Indstillinger!H10,\"\")","v":""},{"$f":"IFERROR(AVERAGEIFS(tblKlassekarakterer[Karakter],tblKlassekarakterer[Klasse],Beregninger!$C7,tblKlassekarakterer[Type],Beregninger!AG$5)*Indstillinger!I10,\"\")","v":""},{"$f":"IFERROR(AVERAGEIFS(tblKlassekarakterer[Karakter],tblKlassekarakterer[Klasse],Beregninger!$C7,tblKlassekarakterer[Type],Beregninger!AH$5)*Indstillinger!J10,\"\")","v":""},{"$f":"IFERROR(AVERAGEIFS(tblKlassekarakterer[Karakter],tblKlassekarakterer[Klasse],Beregninger!$C7,tblKlassekarakterer[Type],Beregninger!AI$5)*Indstillinger!K10,\"\")","v":""},{"$f":"SUM(AC7:AI7)","v":0.1425},{"$f":"SUMIFS(Indstillinger!E10:K10,Beregninger!AC7:AI7,\">0\")","v":0.15},{"$f":"IFERROR(AJ7/AK7,\"\")","v":{"v":0.95,"d":"95%"}},4,"A"]
[null,null,{"$f":"IF(Indstillinger!C11=\"\",\"\",Indstillinger!C11)","v":"Matematik 1"},{"v":0.8,"d":"80%"},{"v":0.8,"d":"80%"},"","","","","","","","","","","","","","","","","","","","","","","",{"$f":"IFERROR(AVERAGEIFS(tblKlassekarakterer[Karakter],tblKlassekarakterer[Klasse],Beregninger!$C8,tblKlassekarakterer[Type],Beregninger!AC$5)*Indstillinger!E11,\"\")","v":0.08000000000000002},{"$f":"IFERROR(AVERAGEIFS(tblKlassekarakterer[Karakter],tblKlassekarakterer[Klasse],Beregninger!$C8,tblKlassekarakterer[Type],Beregninger!AD$5)*Indstillinger!F11,\"\")","v":""},{"$f":"IFERROR(AVERAGEIFS(tblKlassekarakterer[Karakter],tblKlassekarakterer[Klasse],Beregninger!$C8,tblKlassekarakterer[Type],Beregninger!AE$5)*Indstillinger!G11,\"\")","v":""},{"$f":"IFERROR(AVERAGEIFS(tblKlassekarakterer[Karakter],tblKlassekarakterer[Klasse],Beregninger!$C8,tblKlassekarakterer[Type],Beregninger!AF$5)*Indstillinger!H11,\"\")","v":""},{"$f":"IFERROR(AVERAGEIFS(tblKlassekarakterer[Karakter],tblKlassekarakterer[Klasse],Beregninger!$C8,tblKlassekarakterer[Type],Beregninger!AG$5)*Indstillinger!I11,\"\")","v":""},{"$f":"IFERROR(AVERAGEIFS(tblKlassekarakterer[Karakter],tblKlassekarakterer[Klasse],Beregninger!$C8,tblKlassekarakterer[Type],Beregninger!AH$5)*Indstillinger!J11,\"\")","v":""},{"$f":"IFERROR(AVERAGEIFS(tblKlassekarakterer[Karakter],tblKlassekarakterer[Klasse],Beregninger!$C8,tblKlassekarakterer[Type],Beregninger!AI$5)*Indstillinger!K11,\"\")","v":""},0.08000000000000002,{"$f":"SUMIFS(Indstillinger!E11:K11,Beregninger!AC8:AI8,\">0\")","v":0.1},{"v":0.8000000000000002,"d":"80%"},2.67,"B-"]
[null,null,{"$f":"IF(Indstillinger!C12=\"\",\"\",Indstillinger!C12)","v":"Matematik 2"},{"v":0.85,"d":"85%"},{"v":0.95,"d":"95%"},"","","","","","","","","","","","","","","","","","","","","","","",{"$f":"IFERROR(AVERAGEIFS(tblKlassekarakterer[Karakter],tblKlassekarakterer[Klasse],Beregninger!$C9,tblKlassekarakterer[Type],Beregninger!AC$5)*Indstillinger!E12,\"\")","v":0.1275},{"$f":"IFERROR(AVERAGEIFS(tblKlassekarakterer[Karakter],tblKlassekarakterer[Klasse],Beregninger!$C9,tblKlassekarakterer[Type],Beregninger!AD$5)*Indstillinger!F12,\"\")","v":""},{"$f":"IFERROR(AVERAGEIFS(tblKlassekarakterer[Karakter],tblKlassekarakterer[Klasse],Beregninger!$C9,tblKlassekarakterer[Type],Beregninger!AE$5)*Indstillinger!G12,\"\")","v":0.095},{"$f":"IFERROR(AVERAGEIFS(tblKlassekarakterer[Karakter],tblKlassekarakterer[Klasse],Beregninger!$C9,tblKlassekarakterer[Type],Beregninger!AF$5)*Indstillinger!H12,\"\")","v":""},{"$f":"IFERROR(AVERAGEIFS(tblKlassekarakterer[Karakter],tblKlassekarakterer[Klasse],Beregninger!$C9,tblKlassekarakterer[Type],Beregninger!AG$5)*Indstillinger!I12,\"\")","v":""},{"$f":"IFERROR(AVERAGEIFS(tblKlassekarakterer[Karakter],tblKlassekarakterer[Klasse],Beregninger!$C9,tblKlassekarakterer[Type],Beregninger!AH$5)*Indstillinger!J12,\"\")","v":""},{"$f":"IFERROR(AVERAGEIFS(tblKlassekarakterer[Karakter],tblKlassekarakterer[Klasse],Beregninger!$C9,tblKlassekarakterer[Type],Beregninger!AI$5)*Indstillinger!K12,\"\")","v":""},0.2225,{"$f":"SUMIFS(Indstillinger!E12:K12,Beregninger!AC9:AI9,\">0\")","v":0.25},{"v":0.89,"d":"89%"},3.33,"B+"]
[null,null,{"$f":"IF(Indstillinger!C13=\"\",\"\",Indstillinger!C13)","v":"Avanceret programmering i Java"},{"v":0.75,"d":"75%"},"","","","","","","","","","","","","","","","","","","","","","","","",{"$f":"IFERROR(AVERAGEIFS(tblKlassekarakterer[Karakter],tblKlassekarakterer[Klasse],Beregninger!$C10,tblKlassekarakterer[Type],Beregninger!AC$5)*Indstillinger!E13,\"\")","v":""},{"$f":"IFERROR(AVERAGEIFS(tblKlassekarakterer[Karakter],tblKlassekarakterer[Klasse],Beregninger!$C10,tblKlassekarakterer[Type],Beregninger!AD$5)*Indstillinger!F13,\"\")","v":""},{"$f":"IFERROR(AVERAGEIFS(tblKlassekarakterer[Karakter],tblKlassekarakterer[Klasse],Beregninger!$C10,tblKlassekarakterer[Type],Beregninger!AE$5)*Indstillinger!G13,\"\")","v":""},{"$f":"IFERROR(AVERAGEIFS(tblKlassekarakterer[Karakter],tblKlassekarakterer[Klasse],Beregninger!$C10,tblKlassekarakterer[Type],Beregninger!AF$5)*Indstillinger!H13,\"\")","v":""},{"$f":"IFERROR(AVERAGEIFS(tblKlassekarakterer[Karakter],tblKlassekarakterer[Klasse],Beregninger!$C10,tblKlassekarakterer[Type],Beregninger!AG$5)*Indstillinger!I13,\"\")","v":0.15000000000000002},{"$f":"IFERROR(AVERAGEIFS(tblKlassekarakterer[Karakter],tblKlassekarakterer[Klasse],Beregninger!$C10,tblKlassekarakterer[Type],Beregninger!AH$5)*Indstillinger!J13,\"\")","v":""},{"$f":"IFERROR(AVERAGEIFS(tblKlassekarakterer[Karakter],tblKlassekarakterer[Klasse],Beregninger!$C10,tblKlassekarakterer[Type],Beregninger!AI$5)*Indstillinger!K13,\"\")","v":""},0.15000000000000002,{"$f":"SUMIFS(Indstillinger!E13:K13,Beregninger!AC10:AI10,\">0\")","v":0.2},{"v":0.7500000000000001,"d":"75%"},2,"C"]
[null,null,{"$f":"IF(Indstillinger!C14=\"\",\"\",Indstillinger!C14)","v":"Spansk"},{"v":0.5,"d":"50%"},"","","","","","","","","","","","","","","","","","","","","","","","",{"$f":"IFERROR(AVERAGEIFS(tblKlassekarakterer[Karakter],tblKlassekarakterer[Klasse],Beregninger!$C11,tblKlassekarakterer[Type],Beregninger!AC$5)*Indstillinger!E14,\"\")","v":0.05},{"$f":"IFERROR(AVERAGEIFS(tblKlassekarakterer[Karakter],tblKlassekarakterer[Klasse],Beregninger!$C11,tblKlassekarakterer[Type],Beregninger!AD$5)*Indstillinger!F14,\"\")","v":""},{"$f":"IFERROR(AVERAGEIFS(tblKlassekarakterer[Karakter],tblKlassekarakterer[Klasse],Beregninger!$C11,tblKlassekarakterer[Type],Beregninger!AE$5)*Indstillinger!G14,\"\")","v":""},{"$f":"IFERROR(AVERAGEIFS(tblKlassekarakterer[Karakter],tblKlassekarakterer[Klasse],Beregninger!$C11,tblKlassekarakterer[Type],Beregninger!AF$5)*Indstillinger!H14,\"\")","v":""},{"$f":"IFERROR(AVERAGEIFS(tblKlassekarakterer[Karakter],tblKlassekarakterer[Klasse],Beregninger!$C11,tblKlassekarakterer[Type],Beregninger!AG$5)*Indstillinger!I14,\"\")","v":""},{"$f":"IFERROR(AVERAGEIFS(tblKlassekarakterer[Karakter],tblKlassekarakterer[Klasse],Beregninger!$C11,tblKlassekarakterer[Type],Beregninger!AH$5)*Indstillinger!J14,\"\")","v":""},{"$f":"IFERROR(AVERAGEIFS(tblKlassekarakterer[Karakter],tblKlassekarakterer[Klasse],Beregninger!$C11,tblKlassekarakterer[Type],Beregninger!AI$5)*Indstillinger!K14,\"\")","v":""},0.05,{"$f":"SUMIFS(Indstillinger!E14:K14,Beregninger!AC11:AI11,\">0\")","v":0.1},{"v":0.5,"d":"50%"},0,"F"]
[null,null,{"$f":"IF(Indstillinger!C15=\"\",\"\",Indstillinger!C15)","v":"Komposition"},{"v":0.95,"d":"95%"},"","","","","","","","","","","","","","","","","","","","","","","","",{"$f":"IFERROR(AVERAGEIFS(tblKlassekarakterer[Karakter],tblKlassekarakterer[Klasse],Beregninger!$C12,tblKlassekarakterer[Type],Beregninger!AC$5)*Indstillinger!E15,\"\")","v":""},{"$f":"IFERROR(AVERAGEIFS(tblKlassekarakterer[Karakter],tblKlassekarakterer[Klasse],Beregninger!$C12,tblKlassekarakterer[Type],Beregninger!AD$5)*Indstillinger!F15,\"\")","v":0.1425},{"$f":"IFERROR(AVERAGEIFS(tblKlassekarakterer[Karakter],tblKlassekarakterer[Klasse],Beregninger!$C12,tblKlassekarakterer[Type],Beregninger!AE$5)*Indstillinger!G15,\"\")","v":""},{"$f":"IFERROR(AVERAGEIFS(tblKlassekarakterer[Karakter],tblKlassekarakterer[Klasse],Beregninger!$C12,tblKlassekarakterer[Type],Beregninger!AF$5)*Indstillinger!H15,\"\")","v":""},{"$f":"IFERROR(AVERAGEIFS(tblKlassekarakterer[Karakter],tblKlassekarakterer[Klasse],Beregninger!$C12,tblKlassekarakterer[Type],Beregninger!AG$5)*Indstillinger!I15,\"\")","v":""},{"$f":"IFERROR(AVERAGEIFS(tblKlassekarakterer[Karakter],tblKlassekarakterer[Klasse],Beregninger!$C12,tblKlassekarakterer[Type],Beregninger!AH$5)*Indstillinger!J15,\"\")","v":""},{"$f":"IFERROR(AVERAGEIFS(tblKlassekarakterer[Karakter],tblKlassekarakterer[Klasse],Beregninger!$C12,tblKlassekarakterer[Type],Beregninger!AI$5)*Indstillinger!K15,\"\")","v":""},0.1425,{"$f":"SUMIFS(Indstillinger!E15:K15,Beregninger!AC12:AI12,\">0\")","v":0.15},{"v":0.95,"d":"95%"},4,"A"]
[null,null,{"$f":"IF(Indstillinger!C16=\"\",\"\",Indstillinger!C16)","v":""},"","","","","","","","","","","","","","","","","","","","","","","","","",{"$f":"IFERROR(AVERAGEIFS(tblKlassekarakterer[Karakter],tblKlassekarakterer[Klasse],Beregninger!$C13,tblKlassekarakterer[Type],Beregninger!AC$5)*Indstillinger!E16,\"\")","v":""},{"$f":"IFERROR(AVERAGEIFS(tblKlassekarakterer[Karakter],tblKlassekarakterer[Klasse],Beregninger!$C13,tblKlassekarakterer[Type],Beregninger!AD$5)*Indstillinger!F16,\"\")","v":""},{"$f":"IFERROR(AVERAGEIFS(tblKlassekarakterer[Karakter],tblKlassekarakterer[Klasse],Beregninger!$C13,tblKlassekarakterer[Type],Beregninger!AE$5)*Indstillinger!G16,\"\")","v":""},{"$f":"IFERROR(AVERAGEIFS(tblKlassekarakterer[Karakter],tblKlassekarakterer[Klasse],Beregninger!$C13,tblKlassekarakterer[Type],Beregninger!AF$5)*Indstillinger!H16,\"\")","v":""},{"$f":"IFERROR(AVERAGEIFS(tblKlassekarakterer[Karakter],tblKlassekarakterer[Klasse],Beregninger!$C13,tblKlassekarakterer[Type],Beregninger!AG$5)*Indstillinger!I16,\"\")","v":""},{"$f":"IFERROR(AVERAGEIFS(tblKlassekarakterer[Karakter],tblKlassekarakterer[Klasse],Beregninger!$C13,tblKlassekarakterer[Type],Beregninger!AH$5)*Indstillinger!J16,\"\")","v":""},{"$f":"IFERROR(AVERAGEIFS(tblKlassekarakterer[Karakter],tblKlassekarakterer[Klasse],Beregninger!$C13,tblKlassekarakterer[Type],Beregninger!AI$5)*Indstillinger!K16,\"\")","v":""},0,{"$f":"SUMIFS(Indstillinger!E16:K16,Beregninger!AC13:AI13,\">0\")","v":0},"","",""]
[null,null,{"$f":"IF(Indstillinger!C17=\"\",\"\",Indstillinger!C17)","v":""},"","","","","","","","","","","","","","","","","","","","","","","","","",{"$f":"IFERROR(AVERAGEIFS(tblKlassekarakterer[Karakter],tblKlassekarakterer[Klasse],Beregninger!$C14,tblKlassekarakterer[Type],Beregninger!AC$5)*Indstillinger!E17,\"\")","v":""},{"$f":"IFERROR(AVERAGEIFS(tblKlassekarakterer[Karakter],tblKlassekarakterer[Klasse],Beregninger!$C14,tblKlassekarakterer[Type],Beregninger!AD$5)*Indstillinger!F17,\"\")","v":""},{"$f":"IFERROR(AVERAGEIFS(tblKlassekarakterer[Karakter],tblKlassekarakterer[Klasse],Beregninger!$C14,tblKlassekarakterer[Type],Beregninger!AE$5)*Indstillinger!G17,\"\")","v":""},{"$f":"IFERROR(AVERAGEIFS(tblKlassekarakterer[Karakter],tblKlassekarakterer[Klasse],Beregninger!$C14,tblKlassekarakterer[Type],Beregninger!AF$5)*Indstillinger!H17,\"\")","v":""},{"$f":"IFERROR(AVERAGEIFS(tblKlassekarakterer[Karakter],tblKlassekarakterer[Klasse],Beregninger!$C14,tblKlassekarakterer[Type],Beregninger!AG$5)*Indstillinger!I17,\"\")","v":""},{"$f":"IFERROR(AVERAGEIFS(tblKlassekarakterer[Karakter],tblKlassekarakterer[Klasse],Beregninger!$C14,tblKlassekarakterer[Type],Beregninger!AH$5)*Indstillinger!J17,\"\")","v":""},{"$f":"IFERROR(AVERAGEIFS(tblKlassekarakterer[Karakter],tblKlassekarakterer[Klasse],Beregninger!$C14,tblKlassekarakterer[Type],Beregninger!AI$5)*Indstillinger!K17,\"\")","v":""},0,{"$f":"SUMIFS(Indstillinger!E17:K17,Beregninger!AC14:AI14,\">0\")","v":0},"","",""]
[null,null,{"$f":"IF(Indstillinger!C18=\"\",\"\",Indstillinger!C18)","v":""},"","","","","","","","","","","","","","","","","","","","","","","","","",{"$f":"IFERROR(AVERAGEIFS(tblKlassekarakterer[Karakter],tblKlassekarakterer[Klasse],Beregninger!$C15,tblKlassekarakterer[Type],Beregninger!AC$5)*Indstillinger!E18,\"\")","v":""},{"$f":"IFERROR(AVERAGEIFS(tblKlassekarakterer[Karakter],tblKlassekarakterer[Klasse],Beregninger!$C15,tblKlassekarakterer[Type],Beregninger!AD$5)*Indstillinger!F18,\"\")","v":""},{"$f":"IFERROR(AVERAGEIFS(tblKlassekarakterer[Karakter],tblKlassekarakterer[Klasse],Beregninger!$C15,tblKlassekarakterer[Type],Beregninger!AE$5)*Indstillinger!G18,\"\")","v":""},{"$f":"IFERROR(AVERAGEIFS(tblKlassekarakterer[Karakter],tblKlassekarakterer[Klasse],Beregninger!$C15,tblKlassekarakterer[Type],Beregninger!AF$5)*Indstillinger!H18,\"\")","v":""},{"$f":"IFERROR(AVERAGEIFS(tblKlassekarakterer[Karakter],tblKlassekarakterer[Klasse],Beregninger!$C15,tblKlassekarakterer[Type],Beregninger!AG$5)*Indstillinger!I18,\"\")","v":""},{"$f":"IFERROR(AVERAGEIFS(tblKlassekarakterer[Karakter],tblKlassekarakterer[Klasse],Beregninger!$C15,tblKlassekarakterer[Type],Beregninger!AH$5)*Indstillinger!J18,\"\")","v":""},{"$f":"IFERROR(AVERAGEIFS(tblKlassekarakterer[Karakter],tblKlassekarakterer[Klasse],Beregninger!$C15,tblKlassekarakterer[Type],Beregninger!AI$5)*Indstillinger!K18,\"\")","v":""},0,{"$f":"SUMIFS(Indstillinger!E18:K18,Beregninger!AC15:AI15,\">0\")","v":0},"","",""]
{"$rows_left_out":642}