{"text_format":"3","workbook":"xlsx","n_sheets":3,"sheets":["Undervisningslogfil","Kursusliste","Personaleoplysninger"],"not_rendered":{"defined_names":13},"read":"whole","date_system":"1900"}

{"sheet":"Undervisningslogfil","index":0,"n_rows":23,"n_cols":9,"rows_kept":23}
[]
[]
[null,null,"UNDERVISNINGSLOGFIL"]
{"$rows_empty":8}
[null,null,"UNDERVISNINGSDATO","NAVN","FAG","UNDERVISER","OPTAGET","BESTÅET/DUMPET","NOTER"]
[null,null,"2012-06-01","Kim Abercrombie","Medarbejderintroduktion",{"$f":"IF(tblUndervisningslogfil[[#This Row],[FAG]]=\"\",\"\",IFERROR(VLOOKUP(tblUndervisningslogfil[[#This Row],[FAG]],tblKursusliste[],2,0),\"Not Found\"))","v":"Ole Godtfred"},"Ja","Bestå","Fantastisk underviser"]
[null,null,"2012-06-02","Martin Hansen","Medarbejderintroduktion",{"$f":"IF(tblUndervisningslogfil[[#This Row],[FAG]]=\"\",\"\",IFERROR(VLOOKUP(tblUndervisningslogfil[[#This Row],[FAG]],tblKursusliste[],2,0),\"Not Found\"))","v":"Ole Godtfred"},"Ja","Dumpe","Skulle gå tidligt, kunne ikke gennemføre."]
[null,null,"2012-06-03","Daniel Goldschmidt","Medarbejderintroduktion",{"$f":"IF(tblUndervisningslogfil[[#This Row],[FAG]]=\"\",\"\",IFERROR(VLOOKUP(tblUndervisningslogfil[[#This Row],[FAG]],tblKursusliste[],2,0),\"Not Found\"))","v":"Ole Godtfred"},"Ja","Bestå","Endelig tilbud dette kvartal."]
[null,null,"2012-06-03","Martin Hansen","Medarbejderintroduktion",{"$f":"IF(tblUndervisningslogfil[[#This Row],[FAG]]=\"\",\"\",IFERROR(VLOOKUP(tblUndervisningslogfil[[#This Row],[FAG]],tblKursusliste[],2,0),\"Not Found\"))","v":"Ole Godtfred"},"Ja","Bestå","Endelig tilbud dette kvartal."]
[null,null,"2012-06-04","Martin Hansen","Medarbejderfunktioner",{"$f":"IF(tblUndervisningslogfil[[#This Row],[FAG]]=\"\",\"\",IFERROR(VLOOKUP(tblUndervisningslogfil[[#This Row],[FAG]],tblKursusliste[],2,0),\"Not Found\"))","v":"Pernille Halberg"},"Ja","Bestå","Første tilbud for dette kvartal"]
[null,null,"2012-06-04","Daniel Goldschmidt","Medarbejderfunktioner",{"$f":"IF(tblUndervisningslogfil[[#This Row],[FAG]]=\"\",\"\",IFERROR(VLOOKUP(tblUndervisningslogfil[[#This Row],[FAG]],tblKursusliste[],2,0),\"Not Found\"))","v":"Pernille Halberg"},"Ja","Bestå","Første tilbud for dette kvartal"]
[null,null,"2012-06-04","Daniel Goldschmidt","Regnskab på mellemniveau",{"$f":"IF(tblUndervisningslogfil[[#This Row],[FAG]]=\"\",\"\",IFERROR(VLOOKUP(tblUndervisningslogfil[[#This Row],[FAG]],tblKursusliste[],2,0),\"Not Found\"))","v":"Pernille Halberg"},"Ja","Bestå","Kun lukket tilskuerskare."]
[null,null,"2012-06-04","Kim Abercrombie","Medarbejderfunktioner",{"$f":"IF(tblUndervisningslogfil[[#This Row],[FAG]]=\"\",\"\",IFERROR(VLOOKUP(tblUndervisningslogfil[[#This Row],[FAG]],tblKursusliste[],2,0),\"Not Found\"))","v":"Pernille Halberg"},"Ja","Bestå","Første tilbud for dette kvartal"]
[null,null,"2012-06-05","Kim Abercrombie","Regnskab på mellemniveau",{"$f":"IF(tblUndervisningslogfil[[#This Row],[FAG]]=\"\",\"\",IFERROR(VLOOKUP(tblUndervisningslogfil[[#This Row],[FAG]],tblKursusliste[],2,0),\"Not Found\"))","v":"Pernille Halberg"},"Nej","Fremtid","Endnu ikke gennemgået."]
[null,null,"2012-06-05","Martin Hansen","Regnskab på avanceret niveau",{"$f":"IF(tblUndervisningslogfil[[#This Row],[FAG]]=\"\",\"\",IFERROR(VLOOKUP(tblUndervisningslogfil[[#This Row],[FAG]],tblKursusliste[],2,0),\"Not Found\"))","v":"Ole Godtfred"},"Nej","Fremtid","Endnu ikke gennemgået."]
[{"$nulls":5},{"$f":"IF(tblUndervisningslogfil[[#This Row],[FAG]]=\"\",\"\",IFERROR(VLOOKUP(tblUndervisningslogfil[[#This Row],[FAG]],tblKursusliste[],2,0),\"Not Found\"))","v":""}]

{"sheet":"Kursusliste","index":1,"n_rows":10,"n_cols":6,"rows_kept":10}
[]
[]
[null,null,"KURSUSLISTE"]
[]
[null,null,"TITEL","UNDERVISER","BESKRIVELSE","TIMER"]
[null,null,"Medarbejderintroduktion","Ole Godtfred","En grundlæggende kursusintroduktion til nye medarbejdere.  Definerer brugerdefinerede mål og forventninger samt tidsrammer og -grænser.",2]
[null,null,"Medarbejderfunktioner","Pernille Halberg","Grundlæggende medarbejderfunktioner, der dækker medarbejderhåndbogen.",1]
[null,null,"Medarbejderfunktioner","Ole Godtfred","Grundlæggende regnskabsprocedurer og -retningslinjer",1.5]
[null,null,"Regnskab på mellemniveau","Pernille Halberg","Regnskabsprocedurer og -retningslinjer på mellemniveau.",2]
[null,null,"Regnskab på avanceret niveau","Ole Godtfred","Avancerede regnskabsprocedurer og -retningslinjer.",2]

{"sheet":"Personaleoplysninger","index":2,"n_rows":9,"n_cols":5,"rows_kept":9}
[]
[]
[null,null,"PERSONALEINFO"]
[]
[null,null,"NAVN","AFDELING","TITEL"]
[null,null,"Kim Abercrombie","Salg","Hovedbogholder"]
[null,null,"Martin Hansen","Revision","Revisor"]
[null,null,"Daniel Goldschmidt","Revision","Revisor"]
[null,null,"Anne Grethe Hansen","Revision","Revisor"]