{"text_format":"3","workbook":"xlsx","n_sheets":3,"sheets":["Salgsdata","Salgsrapport","Lager"],"not_rendered":{"defined_names":10,"pivot_tables":1},"read":"whole","date_system":"1900"}

{"sheet":"Salgsdata","index":0,"n_rows":13,"n_cols":11,"rows_kept":13}
[]
[null,"DAGLIGT KASSESALG"]
[]
[]
[]
[{"$nulls":10}," "]
[{"$nulls":10}," "]
[null,"DATO","KLOKKESLÆT","TRANSAKTIONSNUMMER","SKU-/PRODUKTNUMMER","BESKRIVELSE","SALGSBELØB","SKAT %","MOMS","I ALT"]
[null,"2012-02-01","10:30:00",1001,90001,{"$f":"IFERROR(IF(ISNA(VLOOKUP(tblSalgsdata[[#This Row],[SKU-/PRODUKTNUMMER]],tbllager[],2,0)),\"\",VLOOKUP(tblSalgsdata[[#This Row],[SKU-/PRODUKTNUMMER]],tbllager[],2,0)),\"Der blev ikke fundet en beskrivelse\")","v":"Tæppe"},{"v":74.95,"d":"kr. 74.95"},{"v":0.05,"d":"5.00%"},{"$f":"tblSalgsdata[[#This Row],[SALGSBELØB]]*tblSalgsdata[[#This Row],[SKAT %]]","v":{"v":3.7475000000000005,"d":"kr. 3.75"}},{"$f":"tblSalgsdata[[#This Row],[SALGSBELØB]]+tblSalgsdata[[#This Row],[MOMS]]","v":{"v":78.6975,"d":"kr. 78.70"}}]
[null,"2012-02-01","10:33:00",1002,90023,{"$f":"IFERROR(IF(ISNA(VLOOKUP(tblSalgsdata[[#This Row],[SKU-/PRODUKTNUMMER]],tbllager[],2,0)),\"\",VLOOKUP(tblSalgsdata[[#This Row],[SKU-/PRODUKTNUMMER]],tbllager[],2,0)),\"Der blev ikke fundet en beskrivelse\")","v":"Dug, 6' rund"},{"v":34.99,"d":"kr. 34.99"},{"v":0.05,"d":"5.00%"},{"$f":"tblSalgsdata[[#This Row],[SALGSBELØB]]*tblSalgsdata[[#This Row],[SKAT %]]","v":{"v":1.7495000000000003,"d":"kr. 1.75"}},{"$f":"tblSalgsdata[[#This Row],[SALGSBELØB]]+tblSalgsdata[[#This Row],[MOMS]]","v":{"v":36.7395,"d":"kr. 36.74"}}]
[null,"2012-02-01","10:45:00",1003,90005,{"$f":"IFERROR(IF(ISNA(VLOOKUP(tblSalgsdata[[#This Row],[SKU-/PRODUKTNUMMER]],tbllager[],2,0)),\"\",VLOOKUP(tblSalgsdata[[#This Row],[SKU-/PRODUKTNUMMER]],tbllager[],2,0)),\"Der blev ikke fundet en beskrivelse\")","v":"Rund tallerken"},{"v":55.95,"d":"kr. 55.95"},{"v":0.05,"d":"5.00%"},{"$f":"tblSalgsdata[[#This Row],[SALGSBELØB]]*tblSalgsdata[[#This Row],[SKAT %]]","v":{"v":2.7975000000000003,"d":"kr. 2.80"}},{"$f":"tblSalgsdata[[#This Row],[SALGSBELØB]]+tblSalgsdata[[#This Row],[MOMS]]","v":{"v":58.7475,"d":"kr. 58.75"}}]
[null,"2012-02-01","10:55:00",1004,90004,{"$f":"IFERROR(IF(ISNA(VLOOKUP(tblSalgsdata[[#This Row],[SKU-/PRODUKTNUMMER]],tbllager[],2,0)),\"\",VLOOKUP(tblSalgsdata[[#This Row],[SKU-/PRODUKTNUMMER]],tbllager[],2,0)),\"Der blev ikke fundet en beskrivelse\")","v":"Firkantet tallerken"},{"v":2.95,"d":"kr. 2.95"},{"v":0.05,"d":"5.00%"},{"$f":"tblSalgsdata[[#This Row],[SALGSBELØB]]*tblSalgsdata[[#This Row],[SKAT %]]","v":{"v":0.14750000000000002,"d":"kr. 0.15"}},{"$f":"tblSalgsdata[[#This Row],[SALGSBELØB]]+tblSalgsdata[[#This Row],[MOMS]]","v":{"v":3.0975,"d":"kr. 3.10"}}]
[null,"2012-02-01","11:45:00",1005,90002,{"$f":"IFERROR(IF(ISNA(VLOOKUP(tblSalgsdata[[#This Row],[SKU-/PRODUKTNUMMER]],tbllager[],2,0)),\"\",VLOOKUP(tblSalgsdata[[#This Row],[SKU-/PRODUKTNUMMER]],tbllager[],2,0)),\"Der blev ikke fundet en beskrivelse\")","v":"Pude"},{"v":14.98,"d":"kr. 14.98"},{"v":0.05,"d":"5.00%"},{"$f":"tblSalgsdata[[#This Row],[SALGSBELØB]]*tblSalgsdata[[#This Row],[SKAT %]]","v":{"v":0.7490000000000001,"d":"kr. 0.75"}},{"$f":"tblSalgsdata[[#This Row],[SALGSBELØB]]+tblSalgsdata[[#This Row],[MOMS]]","v":{"v":15.729000000000001,"d":"kr. 15.73"}}]

{"sheet":"Salgsrapport","index":1,"n_rows":14,"n_cols":7,"rows_kept":14}
[]
[null,"DAGLIGT KASSESALG"]
[]
[]
[]
[]
[]
[null,"SKU-/PRODUKTNUMMER","BESKRIVELSE","DATA","Salgsbeløb","Moms","I alt"]
[null,90001,"Blanket","2012-02-01",{"v":74.95,"d":"kr. 74.95"},{"v":3.7475000000000005,"d":"kr. 3.75"},{"v":78.6975,"d":"kr. 78.70"}]
[null,90002,"Pillow","2012-02-01",{"v":14.98,"d":"kr. 14.98"},{"v":0.7490000000000001,"d":"kr. 0.75"},{"v":15.729000000000001,"d":"kr. 15.73"}]
[null,90004,"Square plate","2012-02-01",{"v":2.95,"d":"kr. 2.95"},{"v":0.14750000000000002,"d":"kr. 0.15"},{"v":3.0975,"d":"kr. 3.10"}]
[null,90005,"Round plate","2012-02-01",{"v":55.95,"d":"kr. 55.95"},{"v":2.7975000000000003,"d":"kr. 2.80"},{"v":58.7475,"d":"kr. 58.75"}]
[null,90023,"Table cloth, 6' round","2012-02-01",{"v":34.99,"d":"kr. 34.99"},{"v":1.7495000000000003,"d":"kr. 1.75"},{"v":36.7395,"d":"kr. 36.74"}]
[null,"Hovedtotal",null,null,{"v":183.82000000000002,"d":"kr. 183.82"},{"v":9.191000000000003,"d":"kr. 9.19"},{"v":193.011,"d":"kr. 193.01"}]

{"sheet":"Lager","index":2,"n_rows":31,"n_cols":3,"rows_kept":31}
[]
[null,"DAGLIGT KASSESALG"]
[]
[]
[]
[]
[]
[null,"SKU-/PRODUKTNUMMER","BESKRIVELSE"]
[null,90001,"Tæppe"]
[null,90002,"Pude"]
[null,90003,"Lagner"]
[null,90004,"Firkantet tallerken"]
[null,90005,"Rund tallerken"]
[null,90006,"Skål, stor"]
[null,90007,"Skål, lille"]
[null,90008,"Rund tallerken, lille"]
[null,90009,"Gaffel, lille"]
[null,90010,"Gaffel, stor"]
[null,90011,"Ske, lille"]
[null,90012,"Ske, stor"]
[null,90013,"Smørkniv, lille"]
[null,90014,"Smørkniv, stor"]
[null,90015,"Dug , 10 x 5"]
[null,90016,"Dug, 8 x 5"]
[null,90017,"Dug, 8 x 8"]
[null,90018,"Dug, 6 x 6"]
[null,90019,"Dug, 6 x 4"]
[null,90020,"Dug, 4 x 4"]
[null,90021,"Dug, 10' rund"]
[null,90022,"Dug, 8' rund"]
[null,90023,"Dug, 6' rund"]