{"text_format":"3","workbook":"xlsx","n_sheets":9,"sheets":["Oversigt","Klasse 1","Klasse 2","Klasse 3","Klasse 4","Klasse 5","Klasse 6","Klasse 7","Oversigt over karakterer"],"not_rendered":{"defined_names":9},"read":"whole","date_system":"1900"}

{"sheet":"Oversigt","index":0,"n_rows":12,"n_cols":7,"rows_kept":12,"merged":[[1,1,1,2]]}
[]
[null,"Skolens navn",null,"  Dit navn:",null," Semester/år:"]
[]
[null,"Klasser","Kredittimer","Aktuelt procenttal","Karakter","Gennemsnit","Vægtet karaktergennemsnit"]
[null,"Klasse 1",{"v":3,"d":"3.0"},{"v":0.8662,"d":"86.62%"},"B",{"v":3,"d":"3.00"},{"$f":"IF(F5<>\"\",F5*C5/(SUM($C$5:$C$11)), \"\")","v":{"v":0.5625,"d":"0.56"}}]
[null,"Klasse 2",{"v":4,"d":"4.0"},null,{"$f":"IF(D6<>\"\",HLOOKUP(D6,'Oversigt over karakterer'!$C$5:$O$7,2),\"\")","v":""},{"$f":"IF(D6<>\"\",HLOOKUP(D6,'Oversigt over karakterer'!$C$5:$O$7,3),\"\")","v":""},""]
[null,"Klasse 3",{"v":2,"d":"2.0"},null,{"$f":"IF(D7<>\"\",HLOOKUP(D7,'Oversigt over karakterer'!$C$5:$O$7,2),\"\")","v":""},{"$f":"IF(D7<>\"\",HLOOKUP(D7,'Oversigt over karakterer'!$C$5:$O$7,3),\"\")","v":""},""]
[null,"Klasse 4",{"v":4,"d":"4.0"},null,{"$f":"IF(D8<>\"\",HLOOKUP(D8,'Oversigt over karakterer'!$C$5:$O$7,2),\"\")","v":""},{"$f":"IF(D8<>\"\",HLOOKUP(D8,'Oversigt over karakterer'!$C$5:$O$7,3),\"\")","v":""},""]
[null,"Klasse 5",{"v":1,"d":"1.0"},null,{"$f":"IF(D9<>\"\",HLOOKUP(D9,'Oversigt over karakterer'!$C$5:$O$7,2),\"\")","v":""},{"$f":"IF(D9<>\"\",HLOOKUP(D9,'Oversigt over karakterer'!$C$5:$O$7,3),\"\")","v":""},""]
[null,"Klasse 6",{"v":1,"d":"1.0"},null,{"$f":"IF(D10<>\"\",HLOOKUP(D10,'Oversigt over karakterer'!$C$5:$O$7,2),\"\")","v":""},{"$f":"IF(D10<>\"\",HLOOKUP(D10,'Oversigt over karakterer'!$C$5:$O$7,3),\"\")","v":""},""]
[null,"Klasse 7",{"v":1,"d":"1.0"},null,{"$f":"IF(D11<>\"\",HLOOKUP(D11,'Oversigt over karakterer'!$C$5:$O$7,2),\"\")","v":""},{"$f":"IF(D11<>\"\",HLOOKUP(D11,'Oversigt over karakterer'!$C$5:$O$7,3),\"\")","v":""},""]
[null,"Totaler",{"$f":"SUM(C5:C11)","v":16},{"$f":"AVERAGE(D5:D11)","v":{"v":0.8662,"d":"86.62%"}},{"$f":"IF(D12<>\"\",HLOOKUP(D12,'Oversigt over karakterer'!$C$5:$O$7,2),\"\")","v":"B"},{"$f":"AVERAGE(F5:F11)","v":{"v":3,"d":"3.00"}},{"$f":"SUM(G5:G11)","v":{"v":0.5625,"d":"0.56"}}]

{"sheet":"Klasse 1","index":1,"n_rows":38,"n_cols":8,"rows_kept":38,"merged":[[1,1,1,2]]}
[]
[null,{"$f":"Oversigt!B5","v":"Klasse 1"}]
[null,"Lærer:",null,null,"Procent af antal mulige point",null,null,{"$f":"IF(SUM($C$35:$H$35) <> 0,SUM($C$34:$H$34)/SUM($C$35:$H$35),\"\")","v":{"v":0.865,"d":"86.50%"}}]
[null,"E-mail:",null,null,"Aktuel karakter",null,null,{"$f":"SUM($C$34:$H$34)","v":{"v":0.17300000000000001,"d":"17.30%"}}]
[]
[null,"Opgaver","Hjemmearbejde","Stile","Quizzer","Projekter","Midtvejseksaminer","Afsluttende eksamen"]
[null,"Vægt",{"v":0.1,"d":"10.0%"},{"v":0.1,"d":"10.0%"},{"v":0.15,"d":"15.0%"},{"v":0.15,"d":"15.0%"},{"v":0.2,"d":"20.0%"},{"v":0.3,"d":"30.0%"}]
[null,"Første hjemmearbejde",0.88]
[null,"Opgave om 2. verdenskrig",null,0.85]
{"$rows_empty":24}
[null,"Point i alt",{"$f":"IF(COUNT(C8:C33) <> 0,AVERAGE(C8:C33) *C7, \"\")","v":{"v":0.08800000000000001,"d":"0.0880"}},{"v":0.085,"d":"0.0850"},"","","",""]
[null,"Samlet antal mulige point",{"$f":"IF(COUNT(C8:C33)<>0,C7,\"\")","v":0.1},0.1,"","","",""]
[null,"Procent af antal mulige point",null,{"$f":"IF(SUM($C$35:$H$35) <> 0,SUM($C$34:$H$34)/SUM($C$35:$H$35),\"\")","v":{"v":0.865,"d":"86.50%"}}]
[null,"Sådan indtastes karakterer:","Indtast de point, du opnåede, over det mulige antal point (f.eks. 15/17)."]
[null,null,"Indtast den opnåede procentdel (f.eks. 85 %)."]

{"sheet":"Klasse 2","index":2,"n_rows":38,"n_cols":8,"rows_kept":38,"merged":[[1,1,1,2]]}
[]
[null,{"$f":"Oversigt!B6","v":"Klasse 2"}]
[null,"Lærer:",null,null,"Procent af antal mulige point",null,null,{"$f":"IF(SUM($C$35:$H$35) <> 0,SUM($C$34:$H$34)/SUM($C$35:$H$35),\"\")","v":""}]
[null,"E-mail:",null,null,"Aktuel karakter",null,null,{"$f":"SUM($C$34:$H$34)","v":{"v":0,"d":"0.00%"}}]
[]
[null,"Opgaver","Hjemmearbejde","Stile","Quizzer","Projekter","Midtvejseksaminer","Afsluttende eksamen"]
[null,"Vægt",{"v":0.1,"d":"10.0%"},{"v":0.1,"d":"10.0%"},{"v":0.15,"d":"15.0%"},{"v":0.15,"d":"15.0%"},{"v":0.2,"d":"20.0%"},{"v":0.3,"d":"30.0%"}]
{"$rows_empty":26}
[null,"Point i alt",{"$f":"IF(COUNT(C8:C33) <> 0,AVERAGE(C8:C33) *C7, \"\")","v":""},"","","","",""]
[null,"Samlet antal mulige point",{"$f":"IF(COUNT(C8:C33)<>0,C7,\"\")","v":""},"","","","",""]
[null,"Procent af antal mulige point",null,{"$f":"IF(SUM($C$35:$H$35) <> 0,SUM($C$34:$H$34)/SUM($C$35:$H$35),\"\")","v":""}]
[null,"Sådan indtastes karakterer:","Indtast de point, du opnåede, over det mulige antal point (f.eks. 15/17)."]
[null,null,"Indtast den opnåede procentdel (f.eks. 85 %)."]

{"sheet":"Klasse 3","index":3,"n_rows":38,"n_cols":8,"rows_kept":38,"merged":[[1,1,1,2]]}
[]
[null,{"$f":"Oversigt!B7","v":"Klasse 3"}]
[null,"Lærer:",null,null,"Procent af antal mulige point",null,null,{"$f":"IF(SUM($C$35:$H$35) <> 0,SUM($C$34:$H$34)/SUM($C$35:$H$35),\"\")","v":""}]
[null,"E-mail:",null,null,"Aktuel karakter",null,null,{"$f":"SUM($C$34:$H$34)","v":{"v":0,"d":"0.00%"}}]
[]
[null,"Opgaver","Hjemmearbejde","Stile","Quizzer","Projekter","Midtvejseksaminer","Afsluttende eksamen"]
[null,"Vægt",{"v":0.1,"d":"10.0%"},{"v":0.1,"d":"10.0%"},{"v":0.15,"d":"15.0%"},{"v":0.15,"d":"15.0%"},{"v":0.2,"d":"20.0%"},{"v":0.3,"d":"30.0%"}]
{"$rows_empty":26}
[null,"Point i alt",{"$f":"IF(COUNT(C8:C33) <> 0,AVERAGE(C8:C33) *C7, \"\")","v":""},"","","","",""]
[null,"Samlet antal mulige point",{"$f":"IF(COUNT(C8:C33)<>0,C7,\"\")","v":""},"","","","",""]
[null,"Procent af antal mulige point",null,{"$f":"IF(SUM($C$35:$H$35) <> 0,SUM($C$34:$H$34)/SUM($C$35:$H$35),\"\")","v":""}]
[null,"Sådan indtastes karakterer:","Indtast de point, du opnåede, over det mulige antal point (f.eks. 15/17)."]
[null,null,"Indtast den opnåede procentdel (f.eks. 85 %)."]

{"sheet":"Klasse 4","index":4,"n_rows":38,"n_cols":8,"rows_kept":38,"merged":[[1,1,1,2]]}
[]
[null,{"$f":"Oversigt!B8","v":"Klasse 4"}]
[null,"Lærer:",null,null,"Procent af antal mulige point"]
[null,"E-mail:",null,null,"Aktuel karakter",null,null,{"$f":"SUM($C$34:$H$34)","v":{"v":0,"d":"0.00%"}}]
[]
[null,"Opgaver","Hjemmearbejde","Stile","Quizzer","Projekter","Midtvejseksaminer","Afsluttende eksamen"]
[null,"Vægt",{"v":0.1,"d":"10.0%"},{"v":0.1,"d":"10.0%"},{"v":0.15,"d":"15.0%"},{"v":0.15,"d":"15.0%"},{"v":0.2,"d":"20.0%"},{"v":0.3,"d":"30.0%"}]
{"$rows_empty":26}
[null,"Point i alt",{"$f":"IF(COUNT(C8:C33) <> 0,AVERAGE(C8:C33) *C7, \"\")","v":""},"","","","",""]
[null,"Samlet antal mulige point",{"$f":"IF(COUNT(C8:C33)<>0,C7,\"\")","v":""},"","","","",""]
[null,"Procent af antal mulige point",null,{"$f":"IF(SUM($C$35:$H$35) <> 0,SUM($C$34:$H$34)/SUM($C$35:$H$35),\"\")","v":""}]
[null,"Sådan indtastes karakterer:","Indtast de point, du opnåede, over det mulige antal point (f.eks. 15/17)."]
[null,null,"Indtast den opnåede procentdel (f.eks. 85 %)."]

{"sheet":"Klasse 5","index":5,"n_rows":38,"n_cols":8,"rows_kept":38,"merged":[[1,1,1,2]]}
[]
[null,{"$f":"Oversigt!B9","v":"Klasse 5"}]
[null,"Lærer:",null,null,"Procent af antal mulige point",null,null,{"$f":"IF(SUM($C$35:$H$35) <> 0,SUM($C$34:$H$34)/SUM($C$35:$H$35),\"\")","v":""}]
[null,"E-mail:",null,null,"Aktuel karakter",null,null,{"$f":"SUM($C$34:$H$34)","v":{"v":0,"d":"0.00%"}}]
[]
[null,"Opgaver","Hjemmearbejde","Stile","Quizzer","Projekter","Midtvejseksaminer","Afsluttende eksamen"]
[null,"Vægt",{"v":0.1,"d":"10.0%"},{"v":0.1,"d":"10.0%"},{"v":0.15,"d":"15.0%"},{"v":0.15,"d":"15.0%"},{"v":0.2,"d":"20.0%"},{"v":0.3,"d":"30.0%"}]
{"$rows_empty":26}
[null,"Point i alt",{"$f":"IF(COUNT(C8:C33) <> 0,AVERAGE(C8:C33) *C7, \"\")","v":""},"","","","",""]
[null,"Samlet antal mulige point",{"$f":"IF(COUNT(C8:C33)<>0,C7,\"\")","v":""},"","","","",""]
[null,"Procent af antal mulige point",null,{"$f":"IF(SUM($C$35:$H$35) <> 0,SUM($C$34:$H$34)/SUM($C$35:$H$35),\"\")","v":""}]
[null,"Sådan indtastes karakterer:","Indtast de point, du opnåede, over det mulige antal point (f.eks. 15/17)."]
[null,null,"Indtast den opnåede procentdel (f.eks. 85 %)."]

{"sheet":"Klasse 6","index":6,"n_rows":38,"n_cols":8,"rows_kept":38,"merged":[[1,1,1,2]]}
[]
[null,{"$f":"Oversigt!B10","v":"Klasse 6"}]
[null,"Lærer:",null,null,"Procent af antal mulige point",null,null,{"$f":"IF(SUM($C$35:$H$35) <> 0,SUM($C$34:$H$34)/SUM($C$35:$H$35),\"\")","v":""}]
[null,"E-mail:",null,null,"Aktuel karakter",null,null,{"$f":"SUM($C$34:$H$34)","v":{"v":0,"d":"0.00%"}}]
[]
[null,"Opgaver","Hjemmearbejde","Stile","Quizzer","Projekter","Midtvejseksaminer","Afsluttende eksamen"]
[null,"Vægt",{"v":0.1,"d":"10.0%"},{"v":0.1,"d":"10.0%"},{"v":0.15,"d":"15.0%"},{"v":0.15,"d":"15.0%"},{"v":0.2,"d":"20.0%"},{"v":0.3,"d":"30.0%"}]
{"$rows_empty":26}
[null,"Point i alt",{"$f":"IF(COUNT(C8:C33) <> 0,AVERAGE(C8:C33) *C7, \"\")","v":""},"","","","",""]
[null,"Samlet antal mulige point",{"$f":"IF(COUNT(C8:C33)<>0,C7,\"\")","v":""},"","","","",""]
[null,"Procent af antal mulige point",null,{"$f":"IF(SUM($C$35:$H$35) <> 0,SUM($C$34:$H$34)/SUM($C$35:$H$35),\"\")","v":""},{"$f":"IF(SUM($C$35:$H$35) <> 0,SUM($C$34:$H$34)/SUM($C$35:$H$35),\"\")","v":""}]
[null,"Sådan indtastes karakterer:","Indtast de point, du opnåede, over det mulige antal point (f.eks. 15/17)."]
[null,null,"Indtast den opnåede procentdel (f.eks. 85 %)."]

{"sheet":"Klasse 7","index":7,"n_rows":38,"n_cols":8,"rows_kept":38,"merged":[[1,1,1,2]]}
[]
[null,{"$f":"Oversigt!B11","v":"Klasse 7"}]
[null,"Lærer:",null,null,"Procent af antal mulige point",null,null,{"$f":"IF(SUM($C$35:$H$35) <> 0,SUM($C$34:$H$34)/SUM($C$35:$H$35),\"\")","v":""}]
[null,"E-mail:",null,null,"Aktuel karakter",null,null,{"$f":"SUM($C$34:$H$34)","v":{"v":0,"d":"0.00%"}}]
[]
[null,"Opgaver","Hjemmearbejde","Stile","Quizzer","Projekter","Midtvejseksaminer","Afsluttende eksamen"]
[null,"Vægt",{"v":0.1,"d":"10.0%"},{"v":0.1,"d":"10.0%"},{"v":0.15,"d":"15.0%"},{"v":0.15,"d":"15.0%"},{"v":0.2,"d":"20.0%"},{"v":0.3,"d":"30.0%"}]
{"$rows_empty":26}
[null,"Point i alt",{"$f":"IF(COUNT(C8:C33) <> 0,AVERAGE(C8:C33) *C7, \"\")","v":""},"","","","",""]
[null,"Samlet antal mulige point",{"$f":"IF(COUNT(C8:C33)<>0,C7,\"\")","v":""},"","","","",""]
[null,"Procent af antal mulige point",null,{"$f":"IF(SUM($C$35:$H$35) <> 0,SUM($C$34:$H$34)/SUM($C$35:$H$35),\"\")","v":""}]
[null,"Sådan indtastes karakterer:","Indtast de point, du opnåede, over det mulige antal point (f.eks. 15/17)."]
[null,null,"Indtast den opnåede procentdel (f.eks. 85 %)."]

{"sheet":"Oversigt over karakterer","index":8,"n_rows":7,"n_cols":15,"rows_kept":7}
[]
[]
[]
[null,"Oversigt over karakterer og gennemsnit"]
[null,"Gennemsnit",{"v":0,"d":"0%"},{"v":0.6,"d":"60%"},{"v":0.63,"d":"63%"},{"v":0.67,"d":"67%"},{"v":0.7,"d":"70%"},{"v":0.73,"d":"73%"},{"v":0.77,"d":"77%"},{"v":0.8,"d":"80%"},{"v":0.83,"d":"83%"},{"v":0.87,"d":"87%"},{"v":0.9,"d":"90%"},{"v":0.93,"d":"93%"},{"v":0.97,"d":"97%"}]
[null,"Karakter","F","D-","D","D+","C-","C","C+","B-","B","B+","A-","A","A+"]
[null,"Gennemsnit",{"v":0,"d":"0.00"},0.67,{"v":1,"d":"1.00"},1.33,1.67,{"v":2,"d":"2.00"},2.33,2.67,{"v":3,"d":"3.00"},3.33,3.67,{"v":4,"d":"4.00"},{"v":4,"d":"4.00"}]