{"text_format":"3","workbook":"xlsx","n_sheets":4,"sheets":["Data grafu","Časová osa – infografika","Informace","Data grafu – skrytý list"],"read":"whole","date_system":"1900"}

{"sheet":"Data grafu","index":0,"n_rows":11,"n_cols":4,"rows_kept":11,"merged":[[1,1,1,2]]}
["Pokud chcete vytvořit časová osa – infografika, zadejte na tomto listu důležité milníky a aktivity.\nV buňce B1 je název tohoto listu. \nInformace o používání tohoto listu, včetně pokynů pro čtečky obrazovky, jsou na listu Informace.\nDalší pokyny jsou v dalších buňkách ve sloupci A.","Data pro infografiku"]
["Způsob zobrazení dat v grafu můžete nastavit tak, že v rozevíracím seznamu v buňce D2 vyberete Rok nebo Den a měsíc.","U milníků můžete zobrazit rok, den a měsíc nebo je nechat prázdné. Vyberte požadovanou možnost vpravo:",null,"Den a měsíc"]
["V buňkách B3 až D3 jsou záhlaví tabulky Data grafu.","Datum","Název milníku","Popis nebo aktivita"]
["Do buněk B4 až B8 zadejte data milníků. \nNázvy milníků zadejte do buněk C4 až C8.\nA do buněk D4 až D8 zadejte popisy milníků nebo aktivit.\nToto je poslední pokyn na tomto listu.",{"$f":"TODAY()","v":"2018-06-27"},"Nastavení srovnávacích testů","Zadejte popis, který vystihuje, co je třeba v této fázi udělat. Může to být podrobný textový popis nebo seznam aktivit."]
[null,{"$f":"B4+30","v":"2018-07-27"},"Spuštění testů","Tento ukázkový text je seznam testů, které je třeba provést v této fázi.\nTest 1\nTest 2\nTest 3"]
[null,{"$f":"B5+60","v":"2018-09-25"},"Kontrola statistik","Buďte kreativní, dejte průchod svým nápadům a začněte vytvářet vlastní osnovu infografiky."]
[null,{"$f":"B6+90","v":"2018-12-24"},"Implementace změn","aktivita 1\naktivita 2\naktivita 3"]
[null,{"$f":"B7+120","v":"2019-04-23"},"Uvedení na trh","Oslava!"]
[]
[]
[null,{"$f":"TEXT(B4,\"mmm\")","v":"Jun"}]

{"sheet":"Časová osa – infografika","index":1,"n_rows":1,"n_cols":1,"rows_kept":1}
["Na tomto listu je infografika časové osy. Začíná v buňce B1. \nPodél křivky, která znázorňuje průběh času, je 5 obrazců ve tvaru obrácené kapky. Nad nimi jsou názvy milníků a uvnitř jejich data. \nVedle každé kapky je popis nebo seznam aktivit pro daný milník. \nPokud chcete aktualizovat obsah tohoto listu, aktualizujte tabulku DataGrafu na listu Data grafu.\nNa tomto listu už nejsou žádné další pokyny."]

{"sheet":"Informace","index":2,"n_rows":7,"n_cols":1,"rows_kept":7}
["O tomto sešitu"]
["Pokyny pro čtečky obrazovky"]
["V tomto sešitu jsou 4 listy. \n\nČasová osa – infografika\nData grafu\nInformace\nData grafu – skrytý list\n\nPokyny pro každý list najdete vždy ve sloupci A od buňky A1. Jsou napsané skrytým textem. Každý krok vás provede informacemi na daném řádku. Každý další krok pokračuje v buňkách A2, A3 a tak dále, pokud není výslovně uvedené něco jiného. Text pokynu by mohl například znít „Další pokyn najdete v buňce A6“. \n\nSkrytý text se nevytiskne.\n\nPokud chcete tyto pokyny z libovolného listu odebrat, stačí jednoduše odstranit sloupec A.\n"]
["Užitečné informace"]
["Tato infografika zobrazuje 5 významných milníků a jejich aktivity nebo popisy na časové ose. Pokud chcete upravit nebo přidat milníky, stačí jednoduše aktualizovat tabulku na listu Data grafu. \n"]
["Milníky můžete zobrazit s rokem, dnem a měsícem nebo prázdným místem, do kterého můžete vložit ikonu nebo textové pole. Požadovaný způsob zobrazení můžete jednoduše vybrat v buňce D2 na listu Data grafu.\n"]
["Toto je poslední pokyn na tomto listu."]

{"sheet":"Data grafu – skrytý list","index":3,"n_rows":7,"n_cols":5,"rows_kept":7,"hidden":true}
["Data na tomto listu se používají k zobrazení dat ve formátu den a měsíc a k zobrazení roků podél křivky plánu v časová osa – infografika.\nNeodstraňujte tento list. Pokud byste tato data upravili nebo odstranili, mohlo by to poškodit integritu grafu na listu Časová osa – infografika.","Data grafu – skrytý list  – NEODSTRAŇUJTE tento list"]
["V buňkách B2 a D2 jsou záhlaví tabulek.","Datum",null,"Rok"]
["V buňce B3 je první datum z listu Data grafu a další data jsou v dalších buňkách sloupce B.\nRok v buňce D3 představuje počáteční rok časové osy.",{"$f":"IFERROR(IF(LEN('Data grafu'!B4)=0,\"\",IF('Data grafu'!$D$2=\"Rok\",YEAR('Data grafu'!B4),IF('Data grafu'!$D$2=\"Prázdné\",\"\",DAY('Data grafu'!B4)&\" \"&TEXT('Data grafu'!B4,\"mmm\")))),\"\")","v":"27 Jun"},null,{"$f":"IFERROR(IF(LEN('Data grafu'!B4)=0,\"\",YEAR('Data grafu'!B4)),\"\")","v":2018},"<-- Počáteční rok u křivky plánu"]
["Rok v buňce D4 představuje prostřední rok časové osy.",{"$f":"IFERROR(IF(LEN('Data grafu'!B5)=0,\"\",IF('Data grafu'!$D$2=\"Rok\",YEAR('Data grafu'!B5),IF('Data grafu'!$D$2=\"Prázdné\",\"\",DAY('Data grafu'!B5)&\" \"&TEXT('Data grafu'!B5,\"mmm\")))),\"\")","v":"27 Jul"},null,{"$f":"IFERROR(IF(LEN('Data grafu'!B4)=0,\"\",IF(YEAR('Data grafu'!$B$6)=$D$3,$D$3,YEAR('Data grafu'!$B$6))),\"\")","v":2018},"<-- Prostřední rok u křivky plánu. Poznámka: Pokud jde o stejný rok jako počáteční, může být tato buňka prázdná."]
["Rok v buňce D5 představuje koncový rok časové osy.\nToto je poslední pokyn na tomto listu.",{"$f":"IFERROR(IF(LEN('Data grafu'!B6)=0,\"\",IF('Data grafu'!$D$2=\"Rok\",YEAR('Data grafu'!B6),IF('Data grafu'!$D$2=\"Prázdné\",\"\",DAY('Data grafu'!B6)&\" \"&TEXT('Data grafu'!B6,\"mmm\")))),\"\")","v":"25 Sep"},null,{"$f":"IFERROR(IF(LEN('Data grafu'!B4)=0,\"\",IF(YEAR('Data grafu'!$B$8)=$D$3,\"\",YEAR('Data grafu'!$B$8))),\"\")","v":2019},"<-- Koncový rok u křivky plánu. Poznámka: Pokud jde o stejný rok jako počáteční, může být tato buňka prázdná."]
[null,{"$f":"IFERROR(IF(LEN('Data grafu'!B7)=0,\"\",IF('Data grafu'!$D$2=\"Rok\",YEAR('Data grafu'!B7),IF('Data grafu'!$D$2=\"Prázdné\",\"\",DAY('Data grafu'!B7)&\" \"&TEXT('Data grafu'!B7,\"mmm\")))),\"\")","v":"24 Dec"}]
[null,{"$f":"IFERROR(IF(LEN('Data grafu'!B8)=0,\"\",IF('Data grafu'!$D$2=\"Rok\",YEAR('Data grafu'!B8),IF('Data grafu'!$D$2=\"Prázdné\",\"\",DAY('Data grafu'!B8)&\" \"&TEXT('Data grafu'!B8,\"mmm\")))),\"\")","v":"23 Apr"}]