{"text_format":"3","workbook":"xlsx","n_sheets":6,"sheets":["Domů","Osobní údaje","Podrobnosti o cestě","Hotel a aktivity","Pronájem auta","Podrobnosti pro případ nouze"],"not_rendered":{"images":19,"defined_names":10},"read":"whole","date_system":"1900"}

{"sheet":"Domů","index":0,"n_rows":34,"n_cols":22,"rows_kept":34,"merged":[[32,1,32,3],[32,6,32,8],[32,11,32,13],[32,16,32,18],[32,21,32,23],[33,1,33,3],[33,6,33,8],[33,11,33,13],[33,16,33,18],[33,21,33,23]]}
{"$rows_empty":32}
[null,{"$f":"OsobníZadání/OsobníVýpočet","v":{"v":1,"d":"100%"}},{"$nulls":4},{"$f":"CestaZadání/CestaVýpočet","v":{"v":0.65,"d":"65%"}},{"$nulls":4},{"$f":"ZadáníHotel/VýpočetHotel","v":{"v":0.5384615384615384,"d":"54%"}},{"$nulls":4},{"$f":"IF('Pronájem auta'!D4=\"Ano\",PoložkaPronájemAuta/VýpočetPronájemAuta,1)","v":{"v":0.2857142857142857,"d":"29%"}},{"$nulls":4},{"$f":"NouzovéZadání/NouzovýVýpočet","v":{"v":0.625,"d":"63%"}}]
[null,{"$f":"TEXT(B33,\"0% \"\"dokončit\"\"\")","v":"100% dokončit"},{"$nulls":4},{"$f":"TEXT(G33,\"0% \"\"dokončit\"\"\")","v":"65% dokončit"},{"$nulls":4},{"$f":"TEXT(L33,\"0% \"\"dokončit\"\"\")","v":"54% dokončit"},{"$nulls":4},{"$f":"TEXT(Q33,\"0% \"\"dokončit\"\"\")","v":"29% dokončit"},{"$nulls":4},{"$f":"TEXT(V33,\"0% \"\"dokončit\"\"\")","v":"63% dokončit"}]

{"sheet":"Osobní údaje","index":1,"n_rows":11,"n_cols":5,"rows_kept":11,"merged":[[4,2,5,2],[4,3,5,3],[4,4,5,4],[7,2,8,2],[7,3,8,3],[7,4,8,4],[17,1,17,4]]}
[]
[]
[{"$f":"IF(COUNTA(B4:B8)<1,\"*\",\"\")","v":""},"Celá jména a přezdívky",{"$f":"IF(E3=\"\",1,\"\")","v":""},"Adresa (domu)","987 North Fifth Street Columbus, TN 01234"]
[null,"Michael Alexander"]
[null,"Michelle Alexander",{"$f":"IF(E5=\"\",1,\"\")","v":""},"Telefon domů",3455550123]
[null,"Sean P. Alexander"]
[]
[null,null,{"$f":"IF((E8=0)+(E8=\"\"),1,\"\")","v":""},"Mobily",3455550124]
[]
[]
[{"$f":"OsobníZadání","v":3},{"$f":"IF(A11<>OsobníVýpočet,\"Chybějící důležité detaily\",\"Dokončení důležitých detailů\")","v":"Dokončení důležitých detailů"}]

{"sheet":"Podrobnosti o cestě","index":2,"n_rows":18,"n_cols":6,"rows_kept":18,"merged":[[23,1,23,5]]}
[]
[]
[null,"Podrobnosti o odletu",null,null,"Porobnosti o návratu"]
[{"$f":"IF(C4=\"\",1,\"\")","v":""},"Datum",{"$f":"TODAY()+45","v":"2013-02-21"},{"$f":"IF(F4=\"\",1,\"\")","v":""},"Datum",{"$f":"TODAY()+51","v":"2013-02-27"}]
[{"$f":"IF(C5=\"\",1,\"\")","v":""},"Letecká společnost","Aerolinky Blue Yonder","","Letecká společnost","Aerolinky Blue Yonder"]
[{"$f":"IF(C6=\"\",1,\"\")","v":""},"Číslo letu","WS192",1,"Číslo letu"]
[{"$f":"IF(C7=\"\",1,\"\")","v":""},"Z","Columbus","","Z","Seattle"]
[{"$f":"IF(C8=\"\",1,\"\")","v":""},"Čas odletu","12:30:00",1,"Čas odletu"]
[null,"Terminál/brána pro odlet",null,1,"Terminál/brána pro odlet"]
[{"$f":"IF(C10=\"\",1,\"\")","v":""},"Do","Seattle",1,"Do"]
[{"$f":"IF(C11=\"\",1,\"\")","v":""},"Doba příletu","12:32:00",1,"Doba příletu"]
[null,"Délka letu","6 hodin",null,"Délka letu"]
[{"$f":"IF(C13=\"\",1,\"\")","v":""},"Čísla míst","A1, A2,A3",{"$f":"IF(F13=\"\",1,\"\")","v":1},"Čísla míst"]
[{"$f":"IF(C14=\"\",1,\"\")","v":""},"Čísla potvrzení","Stejné",{"$f":"IF(F14=\"\",1,\"\")","v":1},"Čísla potvrzení"]
[{"$f":"IF(C15=\"\",1,\"\")","v":""},"Jídlo","Bez omezení",null,"Jídlo"]
[null,"Telefonní číslo letecké společnosti",1235550234,null,"Telefonní číslo letecké společnosti",1235550234]
[]
[{"$f":"CestaZadání","v":13},{"$f":"IF(A18<>CestaVýpočet,\"Chybějící důležité detaily\",\"Dokončení důležitých detailů\")","v":"Chybějící důležité detaily"}]

{"sheet":"Hotel a aktivity","index":3,"n_rows":15,"n_cols":7,"rows_kept":15,"merged":[[21,1,21,6]]}
[]
[]
[null,"Podrobnosti o hotelu/ubytování",{"$nulls":3},"Podrobnosti o prázdninových aktivitách"]
[{"$f":"IF(C4=\"\",1,\"\")","v":""},"Datum rezervace",{"$f":"TODAY()+45","v":"2013-02-21"},null,null,"Činnost 1","Lyžování"]
["","Název hotelu","Alpine Ski House",null,{"$f":"IF(AND($G$4<>\"\",G5=\"\"),1,\"\")","v":1},"Data/časy"]
["","Adresa hotelu","Okružní třída 789",null,{"$f":"IF(AND($G$4<>\"\",G6=\"\"),1,\"\")","v":1},"Datum rezervace"]
["","Telefonní číslo hotelu","Seattle",null,{"$f":"IF(AND($G$4<>\"\",G7=\"\"),1,\"\")","v":1},"Číslo potvrzení"]
["","Datum a čas odbavení",{"$f":"TODAY()+45.5","v":"2013-02-21T12:00:00"},null,null,"Činnost 2","Vinařství a vinice Coho"]
["","Datum a čas odhlášení",{"$f":"TODAY()+50.5","v":"2013-02-26T12:00:00"},null,{"$f":"IF(AND($G$8<>\"\",G9=\"\"),1,\"\")","v":1},"Data/časy"]
["","Číslo potvrzení","CJ1234567",null,{"$f":"IF(AND($G$8<>\"\",G10=\"\"),1,\"\")","v":1},"Datum rezervace"]
[{"$nulls":4},{"$f":"IF(AND($G$8<>\"\",G11=\"\"),1,\"\")","v":1},"Číslo potvrzení"]
[{"$f":"ZadáníHotel","v":7},{"$f":"IF(A12<>VýpočetHotel,\"Chybějící důležité detaily\",\"Dokončení důležitých detailů\")","v":"Chybějící důležité detaily"},{"$nulls":3},"Činnost 3"]
[{"$nulls":4},{"$f":"IF(AND($G$12<>\"\",G13=\"\"),1,\"\")","v":""},"Data/časy"]
[{"$nulls":4},{"$f":"IF(AND($G$12<>\"\",G14=\"\"),1,\"\")","v":""},"Datum rezervace"]
[{"$nulls":4},{"$f":"IF(AND($G$12<>\"\",G15=\"\"),1,\"\")","v":""},"Číslo potvrzení"]

{"sheet":"Pronájem auta","index":4,"n_rows":13,"n_cols":4,"rows_kept":13,"merged":[[18,0,18,4]]}
[]
[]
[null,null,"Informace o pronájmu auta"]
[null,null,"Pronájem auta?","Ano"]
[null,{"$f":"IF(AND($D$4=\"Ano\",D5=\"\"),1,\"\")","v":""},"Datum rezervace",{"$f":"TODAY()+45","v":"2013-02-21"}]
[null,1,"Pronajímatel"]
[null,1,"Datum/čas vyzvednutí"]
[null,1,"Datum/čas vysazení"]
[null,1,"Číslo potvrzení"]
[null,"","Typ vozidla","Ekonomika"]
[null,1,"Telefonní číslo"]
[]
[null,{"$f":"PoložkaPronájemAuta","v":2},{"$f":"IF(B13<>VýpočetPronájemAuta,\"Chybějící důležité detaily\",\"Dokončení důležitých detailů\")","v":"Chybějící důležité detaily"}]

{"sheet":"Podrobnosti pro případ nouze","index":5,"n_rows":11,"n_cols":6,"rows_kept":11,"merged":[[3,4,4,4],[3,5,4,5],[3,6,4,6],[5,4,6,4],[5,5,6,5],[5,6,6,6],[7,5,8,5],[7,6,8,6],[16,1,16,6]]}
[]
[]
[null,"Podrobnosti o pojištění",{"$nulls":3},"Podrobnosti o nouzovém kontaktu"]
[{"$f":"IF(C4=\"\",1,\"\")","v":""},"Pojišťovací společnost","Humongous Insurance",null,{"$f":"IF(G4=\"\",1,\"\")","v":1},"Jméno/vztah/telefonní číslo"]
["","Telefonní číslo",1235550567]
["","Typ pojištění","1900-01-05",null,{"$f":"IF(G6=\"\",1,\"\")","v":1},"Jméno/vztah/telefonní číslo"]
["","Číslo potvrzení","1900-01-05"]
["","Datum nákupu",{"$f":"TODAY()","v":"2013-01-07"},null,null,"Jméno/vztah/telefonní číslo"]
[1,"Data pojistného krytí"]
[]
[{"$f":"NouzovéZadání","v":5},{"$f":"IF(A11<>NouzovýVýpočet,\"Chybějící důležité detaily\",\"Dokončení důležitých detailů\")","v":"Chybějící důležité detaily"}]