{"text_format":"3","workbook":"xlsx","n_sheets":4,"sheets":["Следене на оценките","Вашият успех","Настройки","Изчисления"],"not_rendered":{"defined_names":3,"comments":1},"read":"whole","date_system":"1900"}

{"sheet":"Следене на оценките","index":0,"n_rows":14,"n_cols":6,"rows_kept":14}
[null,"Въведете оценките си тук"]
[]
[null,null,"Предмет","Тип","Описание","Резултат"]
[null,null,"Френски","Домашна работа","История на ВСВ",{"v":0.8,"d":"80%"}]
[null,null,"Разширено програмиране на Java","Средносрочен изпит",null,{"v":0.75,"d":"75%"}]
[null,null,"Испански","Домашна работа",null,{"v":0.5,"d":"50%"}]
[null,null,"Теоретична физика","Домашна работа",null,{"v":0.95,"d":"95%"}]
[null,null,"Френски","Домашна работа","История на Първата световна война",{"v":0.9,"d":"90%"}]
[null,null,"Френски","Домашна работа","Страници 30-41",{"v":0.8,"d":"80%"}]
[null,null,"Съчинение","Есе","Курсова работа",{"v":0.95,"d":"95%"}]
[null,null,"Математика 1","Домашна работа","Страници 21 и 26",{"v":0.8,"d":"80%"}]
[null,null,"Математика 2","Домашна работа","Страници 15 и 18",{"v":0.85,"d":"85%"}]
[null,null,"Математика 1","Домашна работа","Страници 34-36",{"v":0.8,"d":"80%"}]
[null,null,"Математика 2","Тест",null,{"v":0.95,"d":"95%"}]

{"sheet":"Вашият успех","index":1,"n_rows":31,"n_cols":8,"rows_kept":31}
[null,"Вашият успех"]
[]
[null,null,"Общи суми"]
[null,null,{"$f":"\"Часове: \"&SUM(таблПредмети[Кредити])","v":"Часове: 24"},{"$f":"AVERAGE(D7:D31)","v":{"v":0.8104761904761906,"d":"81%"}},{"$f":"AVERAGE(E7:E31)","v":{"v":2.7142857142857144,"d":"2.71"}},{"$f":"SUM(F7:F31)","v":{"v":2.625,"d":"2.63"}},{"$f":"IFERROR(HLOOKUP(D4,послСреденУспех,2),\"\")","v":"B-"}]
[]
[null,null,"Предмети","%","Общ успех","Среден успех","Буква","Цялостно представяне"]
[null,null,{"$f":"Изчисления!C6","v":"Френски"},{"$f":"Изчисления!AL6","v":{"v":0.8333333333333334,"d":"83%"}},{"$f":"Изчисления!AM6","v":{"v":3,"d":"3.00"}},{"$f":"IFERROR(E7*Настройки!D9/SUM(таблПредмети[Кредити]),\"\")","v":{"v":0.375,"d":"0.38"}},{"$f":"Изчисления!AN6","v":"B"}]
[null,null,{"$f":"Изчисления!C7","v":"Теоретична физика"},{"$f":"Изчисления!AL7","v":{"v":0.95,"d":"95%"}},{"$f":"Изчисления!AM7","v":{"v":4,"d":"4.00"}},{"$f":"IFERROR(E8*Настройки!D10/SUM(таблПредмети[Кредити]),\"\")","v":{"v":0.5,"d":"0.50"}},{"$f":"Изчисления!AN7","v":"A"}]
[null,null,{"$f":"Изчисления!C8","v":"Математика 1"},{"$f":"Изчисления!AL8","v":{"v":0.8000000000000002,"d":"80%"}},{"$f":"Изчисления!AM8","v":2.67},{"$f":"IFERROR(E9*Настройки!D11/SUM(таблПредмети[Кредити]),\"\")","v":{"v":0.445,"d":"0.45"}},{"$f":"Изчисления!AN8","v":"B-"}]
[null,null,{"$f":"Изчисления!C9","v":"Математика 2"},{"$f":"Изчисления!AL9","v":{"v":0.89,"d":"89%"}},{"$f":"Изчисления!AM9","v":3.33},{"$f":"IFERROR(E10*Настройки!D12/SUM(таблПредмети[Кредити]),\"\")","v":{"v":0.555,"d":"0.56"}},{"$f":"Изчисления!AN9","v":"B+"}]
[null,null,{"$f":"Изчисления!C10","v":"Разширено програмиране на Java"},{"$f":"Изчисления!AL10","v":{"v":0.7500000000000001,"d":"75%"}},{"$f":"Изчисления!AM10","v":{"v":2,"d":"2.00"}},{"$f":"IFERROR(E11*Настройки!D13/SUM(таблПредмети[Кредити]),\"\")","v":{"v":0.4166666666666667,"d":"0.42"}},{"$f":"Изчисления!AN10","v":"C"}]
[null,null,{"$f":"Изчисления!C11","v":"Испански"},{"$f":"Изчисления!AL11","v":{"v":0.5,"d":"50%"}},{"$f":"Изчисления!AM11","v":{"v":0,"d":"0.00"}},{"$f":"IFERROR(E12*Настройки!D14/SUM(таблПредмети[Кредити]),\"\")","v":{"v":0,"d":"0.00"}},{"$f":"Изчисления!AN11","v":"F"}]
[null,null,{"$f":"Изчисления!C12","v":"Съчинение"},{"$f":"Изчисления!AL12","v":{"v":0.95,"d":"95%"}},{"$f":"Изчисления!AM12","v":{"v":4,"d":"4.00"}},{"$f":"IFERROR(E13*Настройки!D15/SUM(таблПредмети[Кредити]),\"\")","v":{"v":0.3333333333333333,"d":"0.33"}},{"$f":"Изчисления!AN12","v":"A"}]
[null,null,{"$f":"Изчисления!C13","v":""},{"$f":"Изчисления!AL13","v":""},{"$f":"Изчисления!AM13","v":""},{"$f":"IFERROR(E14*Настройки!D16/SUM(таблПредмети[Кредити]),\"\")","v":""},{"$f":"Изчисления!AN13","v":""}]
[null,null,{"$f":"Изчисления!C14","v":""},{"$f":"Изчисления!AL14","v":""},{"$f":"Изчисления!AM14","v":""},{"$f":"IFERROR(E15*Настройки!D17/SUM(таблПредмети[Кредити]),\"\")","v":""},{"$f":"Изчисления!AN14","v":""}]
{"$rows_left_out":17}
{"sheet":"Настройки","index":2,"n_rows":15,"n_cols":16,"rows_kept":15,"merged":[[5,2,5,15]]}
[null,"Настройки"]
[null,null,"Оценки и среден успех"]
[null,null,"Процент",{"v":0,"d":"0%"},{"v":0.6,"d":"60%"},{"v":0.63,"d":"63%"},{"v":0.67,"d":"67%"},{"v":0.7,"d":"70%"},{"v":0.73,"d":"73%"},{"v":0.77,"d":"77%"},{"v":0.8,"d":"80%"},{"v":0.83,"d":"83%"},{"v":0.87,"d":"87%"},{"v":0.9,"d":"90%"},{"v":0.93,"d":"93%"},{"v":0.97,"d":"97%"}]
[null,null,"Крайна оценка","F","D-","D","D+","C-","C","C+","B-","B","B+","A-","A","A+"]
[null,null,"Общ успех",0,0.67,1,1.33,1.67,2,2.33,2.67,3,3.33,3.67,4,4]
[]
[null,null,"Претеглени оценки за до 25 предмета"]
[null,null,"Предмети, които вземате","Кредити","Домашна работа","Есе","Тест","Проект","Средносрочен изпит","Заключителен изпит","Други","% общо"]
[null,null,"Френски",{"v":3,"d":"3.0"},{"v":0.1,"d":"10%"},{"v":0.15,"d":"15%"},{"v":0.15,"d":"15%"},{"v":0.1,"d":"10%"},{"v":0.2,"d":"20%"},{"v":0.3,"d":"30%"},null,{"$f":"SUM(таблПредмети[[#This Row],[Домашна работа]:[Други]])","v":{"v":1,"d":"100%"}}]
[null,null,"Теоретична физика",{"v":3,"d":"3.0"},{"v":0.15,"d":"15%"},{"v":0.15,"d":"15%"},{"v":0.1,"d":"10%"},{"v":0.1,"d":"10%"},{"v":0.15,"d":"15%"},{"v":0.3,"d":"30%"},{"v":0.05,"d":"5%"},{"$f":"SUM(таблПредмети[[#This Row],[Домашна работа]:[Други]])","v":{"v":1,"d":"100%"}}]
[null,null,"Математика 1",{"v":4,"d":"4.0"},{"v":0.1,"d":"10%"},{"v":0.15,"d":"15%"},{"v":0.15,"d":"15%"},{"v":0.1,"d":"10%"},{"v":0.2,"d":"20%"},{"v":0.3,"d":"30%"},null,{"$f":"SUM(таблПредмети[[#This Row],[Домашна работа]:[Други]])","v":{"v":1,"d":"100%"}}]
[null,null,"Математика 2",{"v":4,"d":"4.0"},{"v":0.15,"d":"15%"},{"v":0.15,"d":"15%"},{"v":0.1,"d":"10%"},{"v":0.1,"d":"10%"},{"v":0.15,"d":"15%"},{"v":0.3,"d":"30%"},{"v":0.05,"d":"5%"},{"$f":"SUM(таблПредмети[[#This Row],[Домашна работа]:[Други]])","v":{"v":1,"d":"100%"}}]
[null,null,"Разширено програмиране на Java",{"v":5,"d":"5.0"},{"v":0.15,"d":"15%"},{"v":0.15,"d":"15%"},{"v":0.1,"d":"10%"},{"v":0.1,"d":"10%"},{"v":0.2,"d":"20%"},{"v":0.3,"d":"30%"},null,{"$f":"SUM(таблПредмети[[#This Row],[Домашна работа]:[Други]])","v":{"v":1,"d":"100%"}}]
[null,null,"Испански",{"v":3,"d":"3.0"},{"v":0.1,"d":"10%"},{"v":0.15,"d":"15%"},{"v":0.17,"d":"17%"},{"v":0.13,"d":"13%"},{"v":0.2,"d":"20%"},{"v":0.2,"d":"20%"},{"v":0.05,"d":"5%"},{"$f":"SUM(таблПредмети[[#This Row],[Домашна работа]:[Други]])","v":{"v":1,"d":"100%"}}]
[null,null,"Съчинение",{"v":2,"d":"2.0"},{"v":0.15,"d":"15%"},{"v":0.15,"d":"15%"},{"v":0.12,"d":"12%"},{"v":0.15,"d":"15%"},{"v":0.15,"d":"15%"},{"v":0.25,"d":"25%"},{"v":0.03,"d":"3%"},{"$f":"SUM(таблПредмети[[#This Row],[Домашна работа]:[Други]])","v":{"v":1,"d":"100%"}}]
{"$rows_left_out":1}
{"sheet":"Изчисления","index":3,"n_rows":657,"n_cols":40,"rows_kept":657,"hidden":true}
[null,"Изчисления"]
[null,null,"Този работен лист съдържа изчисленията за вашите оценки и среден успех и трябва да остане скрит. Всякакви промени в този лист може да доведат до грешки."]
[]
[null,null,"Текущ списък на курсове","Успех (от 1)",{"$nulls":24},"Изчисляване на оценка"]
[null,null,"Предмет",1,2,3,4,5,6,7,8,9,10,11,12,13,14,15,16,17,18,19,20,21,22,23,24,25,{"$f":"таблПредмети[[#Headers],[Домашна работа]]","v":"Домашна работа"},{"$f":"таблПредмети[[#Headers],[Есе]]","v":"Есе"},{"$f":"таблПредмети[[#Headers],[Тест]]","v":"Тест"},{"$f":"таблПредмети[[#Headers],[Проект]]","v":"Проект"},{"$f":"таблПредмети[[#Headers],[Средносрочен изпит]]","v":"Средносрочен изпит"},{"$f":"таблПредмети[[#Headers],[Заключителен изпит]]","v":"Заключителен изпит"},{"$f":"таблПредмети[[#Headers],[Други]]","v":"Други"},"Общо","Общо възможни точки","Общо %","Оценка","Крайна оценка"]
[null,null,{"$f":"IF(Настройки!C9=\"\",\"\",Настройки!C9)","v":"Френски"},{"$f":"IFERROR(INDEX(тблОценкиПредмети[],MATCH($C6:$C30&D$5:AB$5,Изчисления!$C$33:$C$657,0),4),\"\")","v":{"v":0.8,"d":"80%"}},{"v":0.9,"d":"90%"},{"v":0.8,"d":"80%"},"","","","","","","","","","","","","","","","","","","","","","",{"$f":"IFERROR(AVERAGEIFS(тблОценкиПредмети[Резултат],тблОценкиПредмети[Предмет],Изчисления!$C6,тблОценкиПредмети[Тип],Изчисления!AC$5)*Настройки!E9,\"\")","v":0.08333333333333334},{"$f":"IFERROR(AVERAGEIFS(тблОценкиПредмети[Резултат],тблОценкиПредмети[Предмет],Изчисления!$C6,тблОценкиПредмети[Тип],Изчисления!AD$5)*Настройки!F9,\"\")","v":""},{"$f":"IFERROR(AVERAGEIFS(тблОценкиПредмети[Резултат],тблОценкиПредмети[Предмет],Изчисления!$C6,тблОценкиПредмети[Тип],Изчисления!AE$5)*Настройки!G9,\"\")","v":""},{"$f":"IFERROR(AVERAGEIFS(тблОценкиПредмети[Резултат],тблОценкиПредмети[Предмет],Изчисления!$C6,тблОценкиПредмети[Тип],Изчисления!AF$5)*Настройки!H9,\"\")","v":""},{"$f":"IFERROR(AVERAGEIFS(тблОценкиПредмети[Резултат],тблОценкиПредмети[Предмет],Изчисления!$C6,тблОценкиПредмети[Тип],Изчисления!AG$5)*Настройки!I9,\"\")","v":""},{"$f":"IFERROR(AVERAGEIFS(тблОценкиПредмети[Резултат],тблОценкиПредмети[Предмет],Изчисления!$C6,тблОценкиПредмети[Тип],Изчисления!AH$5)*Настройки!J9,\"\")","v":""},{"$f":"IFERROR(AVERAGEIFS(тблОценкиПредмети[Резултат],тблОценкиПредмети[Предмет],Изчисления!$C6,тблОценкиПредмети[Тип],Изчисления!AI$5)*Настройки!K9,\"\")","v":""},{"$f":"SUM(AC6:AI6)","v":0.08333333333333334},{"$f":"SUMIFS(Настройки!E9:K9,Изчисления!AC6:AI6,\">0\")","v":0.1},{"$f":"IFERROR(AJ6/AK6,\"\")","v":{"v":0.8333333333333334,"d":"83%"}},{"$f":"IFERROR(HLOOKUP(AL6,послСреденУспех,3),\"\")","v":3},{"$f":"IFERROR(HLOOKUP(AL6,послСреденУспех,2),\"\")","v":"B"}]
[null,null,{"$f":"IF(Настройки!C10=\"\",\"\",Настройки!C10)","v":"Теоретична физика"},{"v":0.95,"d":"95%"},"","","","","","","","","","","","","","","","","","","","","","","","",{"$f":"IFERROR(AVERAGEIFS(тблОценкиПредмети[Резултат],тблОценкиПредмети[Предмет],Изчисления!$C7,тблОценкиПредмети[Тип],Изчисления!AC$5)*Настройки!E10,\"\")","v":0.1425},{"$f":"IFERROR(AVERAGEIFS(тблОценкиПредмети[Резултат],тблОценкиПредмети[Предмет],Изчисления!$C7,тблОценкиПредмети[Тип],Изчисления!AD$5)*Настройки!F10,\"\")","v":""},{"$f":"IFERROR(AVERAGEIFS(тблОценкиПредмети[Резултат],тблОценкиПредмети[Предмет],Изчисления!$C7,тблОценкиПредмети[Тип],Изчисления!AE$5)*Настройки!G10,\"\")","v":""},{"$f":"IFERROR(AVERAGEIFS(тблОценкиПредмети[Резултат],тблОценкиПредмети[Предмет],Изчисления!$C7,тблОценкиПредмети[Тип],Изчисления!AF$5)*Настройки!H10,\"\")","v":""},{"$f":"IFERROR(AVERAGEIFS(тблОценкиПредмети[Резултат],тблОценкиПредмети[Предмет],Изчисления!$C7,тблОценкиПредмети[Тип],Изчисления!AG$5)*Настройки!I10,\"\")","v":""},{"$f":"IFERROR(AVERAGEIFS(тблОценкиПредмети[Резултат],тблОценкиПредмети[Предмет],Изчисления!$C7,тблОценкиПредмети[Тип],Изчисления!AH$5)*Настройки!J10,\"\")","v":""},{"$f":"IFERROR(AVERAGEIFS(тблОценкиПредмети[Резултат],тблОценкиПредмети[Предмет],Изчисления!$C7,тблОценкиПредмети[Тип],Изчисления!AI$5)*Настройки!K10,\"\")","v":""},{"$f":"SUM(AC7:AI7)","v":0.1425},{"$f":"SUMIFS(Настройки!E10:K10,Изчисления!AC7:AI7,\">0\")","v":0.15},{"$f":"IFERROR(AJ7/AK7,\"\")","v":{"v":0.95,"d":"95%"}},4,"A"]
[null,null,{"$f":"IF(Настройки!C11=\"\",\"\",Настройки!C11)","v":"Математика 1"},{"v":0.8,"d":"80%"},{"v":0.8,"d":"80%"},"","","","","","","","","","","","","","","","","","","","","","","",{"$f":"IFERROR(AVERAGEIFS(тблОценкиПредмети[Резултат],тблОценкиПредмети[Предмет],Изчисления!$C8,тблОценкиПредмети[Тип],Изчисления!AC$5)*Настройки!E11,\"\")","v":0.08000000000000002},{"$f":"IFERROR(AVERAGEIFS(тблОценкиПредмети[Резултат],тблОценкиПредмети[Предмет],Изчисления!$C8,тблОценкиПредмети[Тип],Изчисления!AD$5)*Настройки!F11,\"\")","v":""},{"$f":"IFERROR(AVERAGEIFS(тблОценкиПредмети[Резултат],тблОценкиПредмети[Предмет],Изчисления!$C8,тблОценкиПредмети[Тип],Изчисления!AE$5)*Настройки!G11,\"\")","v":""},{"$f":"IFERROR(AVERAGEIFS(тблОценкиПредмети[Резултат],тблОценкиПредмети[Предмет],Изчисления!$C8,тблОценкиПредмети[Тип],Изчисления!AF$5)*Настройки!H11,\"\")","v":""},{"$f":"IFERROR(AVERAGEIFS(тблОценкиПредмети[Резултат],тблОценкиПредмети[Предмет],Изчисления!$C8,тблОценкиПредмети[Тип],Изчисления!AG$5)*Настройки!I11,\"\")","v":""},{"$f":"IFERROR(AVERAGEIFS(тблОценкиПредмети[Резултат],тблОценкиПредмети[Предмет],Изчисления!$C8,тблОценкиПредмети[Тип],Изчисления!AH$5)*Настройки!J11,\"\")","v":""},{"$f":"IFERROR(AVERAGEIFS(тблОценкиПредмети[Резултат],тблОценкиПредмети[Предмет],Изчисления!$C8,тблОценкиПредмети[Тип],Изчисления!AI$5)*Настройки!K11,\"\")","v":""},0.08000000000000002,{"$f":"SUMIFS(Настройки!E11:K11,Изчисления!AC8:AI8,\">0\")","v":0.1},{"v":0.8000000000000002,"d":"80%"},2.67,"B-"]
[null,null,{"$f":"IF(Настройки!C12=\"\",\"\",Настройки!C12)","v":"Математика 2"},{"v":0.85,"d":"85%"},{"v":0.95,"d":"95%"},"","","","","","","","","","","","","","","","","","","","","","","",{"$f":"IFERROR(AVERAGEIFS(тблОценкиПредмети[Резултат],тблОценкиПредмети[Предмет],Изчисления!$C9,тблОценкиПредмети[Тип],Изчисления!AC$5)*Настройки!E12,\"\")","v":0.1275},{"$f":"IFERROR(AVERAGEIFS(тблОценкиПредмети[Резултат],тблОценкиПредмети[Предмет],Изчисления!$C9,тблОценкиПредмети[Тип],Изчисления!AD$5)*Настройки!F12,\"\")","v":""},{"$f":"IFERROR(AVERAGEIFS(тблОценкиПредмети[Резултат],тблОценкиПредмети[Предмет],Изчисления!$C9,тблОценкиПредмети[Тип],Изчисления!AE$5)*Настройки!G12,\"\")","v":0.095},{"$f":"IFERROR(AVERAGEIFS(тблОценкиПредмети[Резултат],тблОценкиПредмети[Предмет],Изчисления!$C9,тблОценкиПредмети[Тип],Изчисления!AF$5)*Настройки!H12,\"\")","v":""},{"$f":"IFERROR(AVERAGEIFS(тблОценкиПредмети[Резултат],тблОценкиПредмети[Предмет],Изчисления!$C9,тблОценкиПредмети[Тип],Изчисления!AG$5)*Настройки!I12,\"\")","v":""},{"$f":"IFERROR(AVERAGEIFS(тблОценкиПредмети[Резултат],тблОценкиПредмети[Предмет],Изчисления!$C9,тблОценкиПредмети[Тип],Изчисления!AH$5)*Настройки!J12,\"\")","v":""},{"$f":"IFERROR(AVERAGEIFS(тблОценкиПредмети[Резултат],тблОценкиПредмети[Предмет],Изчисления!$C9,тблОценкиПредмети[Тип],Изчисления!AI$5)*Настройки!K12,\"\")","v":""},0.2225,{"$f":"SUMIFS(Настройки!E12:K12,Изчисления!AC9:AI9,\">0\")","v":0.25},{"v":0.89,"d":"89%"},3.33,"B+"]
[null,null,{"$f":"IF(Настройки!C13=\"\",\"\",Настройки!C13)","v":"Разширено програмиране на Java"},{"v":0.75,"d":"75%"},"","","","","","","","","","","","","","","","","","","","","","","","",{"$f":"IFERROR(AVERAGEIFS(тблОценкиПредмети[Резултат],тблОценкиПредмети[Предмет],Изчисления!$C10,тблОценкиПредмети[Тип],Изчисления!AC$5)*Настройки!E13,\"\")","v":""},{"$f":"IFERROR(AVERAGEIFS(тблОценкиПредмети[Резултат],тблОценкиПредмети[Предмет],Изчисления!$C10,тблОценкиПредмети[Тип],Изчисления!AD$5)*Настройки!F13,\"\")","v":""},{"$f":"IFERROR(AVERAGEIFS(тблОценкиПредмети[Резултат],тблОценкиПредмети[Предмет],Изчисления!$C10,тблОценкиПредмети[Тип],Изчисления!AE$5)*Настройки!G13,\"\")","v":""},{"$f":"IFERROR(AVERAGEIFS(тблОценкиПредмети[Резултат],тблОценкиПредмети[Предмет],Изчисления!$C10,тблОценкиПредмети[Тип],Изчисления!AF$5)*Настройки!H13,\"\")","v":""},{"$f":"IFERROR(AVERAGEIFS(тблОценкиПредмети[Резултат],тблОценкиПредмети[Предмет],Изчисления!$C10,тблОценкиПредмети[Тип],Изчисления!AG$5)*Настройки!I13,\"\")","v":0.15000000000000002},{"$f":"IFERROR(AVERAGEIFS(тблОценкиПредмети[Резултат],тблОценкиПредмети[Предмет],Изчисления!$C10,тблОценкиПредмети[Тип],Изчисления!AH$5)*Настройки!J13,\"\")","v":""},{"$f":"IFERROR(AVERAGEIFS(тблОценкиПредмети[Резултат],тблОценкиПредмети[Предмет],Изчисления!$C10,тблОценкиПредмети[Тип],Изчисления!AI$5)*Настройки!K13,\"\")","v":""},0.15000000000000002,{"$f":"SUMIFS(Настройки!E13:K13,Изчисления!AC10:AI10,\">0\")","v":0.2},{"v":0.7500000000000001,"d":"75%"},2,"C"]
[null,null,{"$f":"IF(Настройки!C14=\"\",\"\",Настройки!C14)","v":"Испански"},{"v":0.5,"d":"50%"},"","","","","","","","","","","","","","","","","","","","","","","","",{"$f":"IFERROR(AVERAGEIFS(тблОценкиПредмети[Резултат],тблОценкиПредмети[Предмет],Изчисления!$C11,тблОценкиПредмети[Тип],Изчисления!AC$5)*Настройки!E14,\"\")","v":0.05},{"$f":"IFERROR(AVERAGEIFS(тблОценкиПредмети[Резултат],тблОценкиПредмети[Предмет],Изчисления!$C11,тблОценкиПредмети[Тип],Изчисления!AD$5)*Настройки!F14,\"\")","v":""},{"$f":"IFERROR(AVERAGEIFS(тблОценкиПредмети[Резултат],тблОценкиПредмети[Предмет],Изчисления!$C11,тблОценкиПредмети[Тип],Изчисления!AE$5)*Настройки!G14,\"\")","v":""},{"$f":"IFERROR(AVERAGEIFS(тблОценкиПредмети[Резултат],тблОценкиПредмети[Предмет],Изчисления!$C11,тблОценкиПредмети[Тип],Изчисления!AF$5)*Настройки!H14,\"\")","v":""},{"$f":"IFERROR(AVERAGEIFS(тблОценкиПредмети[Резултат],тблОценкиПредмети[Предмет],Изчисления!$C11,тблОценкиПредмети[Тип],Изчисления!AG$5)*Настройки!I14,\"\")","v":""},{"$f":"IFERROR(AVERAGEIFS(тблОценкиПредмети[Резултат],тблОценкиПредмети[Предмет],Изчисления!$C11,тблОценкиПредмети[Тип],Изчисления!AH$5)*Настройки!J14,\"\")","v":""},{"$f":"IFERROR(AVERAGEIFS(тблОценкиПредмети[Резултат],тблОценкиПредмети[Предмет],Изчисления!$C11,тблОценкиПредмети[Тип],Изчисления!AI$5)*Настройки!K14,\"\")","v":""},0.05,{"$f":"SUMIFS(Настройки!E14:K14,Изчисления!AC11:AI11,\">0\")","v":0.1},{"v":0.5,"d":"50%"},0,"F"]
[null,null,{"$f":"IF(Настройки!C15=\"\",\"\",Настройки!C15)","v":"Съчинение"},{"v":0.95,"d":"95%"},"","","","","","","","","","","","","","","","","","","","","","","","",{"$f":"IFERROR(AVERAGEIFS(тблОценкиПредмети[Резултат],тблОценкиПредмети[Предмет],Изчисления!$C12,тблОценкиПредмети[Тип],Изчисления!AC$5)*Настройки!E15,\"\")","v":""},{"$f":"IFERROR(AVERAGEIFS(тблОценкиПредмети[Резултат],тблОценкиПредмети[Предмет],Изчисления!$C12,тблОценкиПредмети[Тип],Изчисления!AD$5)*Настройки!F15,\"\")","v":0.1425},{"$f":"IFERROR(AVERAGEIFS(тблОценкиПредмети[Резултат],тблОценкиПредмети[Предмет],Изчисления!$C12,тблОценкиПредмети[Тип],Изчисления!AE$5)*Настройки!G15,\"\")","v":""},{"$f":"IFERROR(AVERAGEIFS(тблОценкиПредмети[Резултат],тблОценкиПредмети[Предмет],Изчисления!$C12,тблОценкиПредмети[Тип],Изчисления!AF$5)*Настройки!H15,\"\")","v":""},{"$f":"IFERROR(AVERAGEIFS(тблОценкиПредмети[Резултат],тблОценкиПредмети[Предмет],Изчисления!$C12,тблОценкиПредмети[Тип],Изчисления!AG$5)*Настройки!I15,\"\")","v":""},{"$f":"IFERROR(AVERAGEIFS(тблОценкиПредмети[Резултат],тблОценкиПредмети[Предмет],Изчисления!$C12,тблОценкиПредмети[Тип],Изчисления!AH$5)*Настройки!J15,\"\")","v":""},{"$f":"IFERROR(AVERAGEIFS(тблОценкиПредмети[Резултат],тблОценкиПредмети[Предмет],Изчисления!$C12,тблОценкиПредмети[Тип],Изчисления!AI$5)*Настройки!K15,\"\")","v":""},0.1425,{"$f":"SUMIFS(Настройки!E15:K15,Изчисления!AC12:AI12,\">0\")","v":0.15},{"v":0.95,"d":"95%"},4,"A"]
[null,null,{"$f":"IF(Настройки!C16=\"\",\"\",Настройки!C16)","v":""},"","","","","","","","","","","","","","","","","","","","","","","","","",{"$f":"IFERROR(AVERAGEIFS(тблОценкиПредмети[Резултат],тблОценкиПредмети[Предмет],Изчисления!$C13,тблОценкиПредмети[Тип],Изчисления!AC$5)*Настройки!E16,\"\")","v":""},{"$f":"IFERROR(AVERAGEIFS(тблОценкиПредмети[Резултат],тблОценкиПредмети[Предмет],Изчисления!$C13,тблОценкиПредмети[Тип],Изчисления!AD$5)*Настройки!F16,\"\")","v":""},{"$f":"IFERROR(AVERAGEIFS(тблОценкиПредмети[Резултат],тблОценкиПредмети[Предмет],Изчисления!$C13,тблОценкиПредмети[Тип],Изчисления!AE$5)*Настройки!G16,\"\")","v":""},{"$f":"IFERROR(AVERAGEIFS(тблОценкиПредмети[Резултат],тблОценкиПредмети[Предмет],Изчисления!$C13,тблОценкиПредмети[Тип],Изчисления!AF$5)*Настройки!H16,\"\")","v":""},{"$f":"IFERROR(AVERAGEIFS(тблОценкиПредмети[Резултат],тблОценкиПредмети[Предмет],Изчисления!$C13,тблОценкиПредмети[Тип],Изчисления!AG$5)*Настройки!I16,\"\")","v":""},{"$f":"IFERROR(AVERAGEIFS(тблОценкиПредмети[Резултат],тблОценкиПредмети[Предмет],Изчисления!$C13,тблОценкиПредмети[Тип],Изчисления!AH$5)*Настройки!J16,\"\")","v":""},{"$f":"IFERROR(AVERAGEIFS(тблОценкиПредмети[Резултат],тблОценкиПредмети[Предмет],Изчисления!$C13,тблОценкиПредмети[Тип],Изчисления!AI$5)*Настройки!K16,\"\")","v":""},{"$f":"SUM(AC13:AI13)","v":0},{"$f":"SUMIFS(Настройки!E16:K16,Изчисления!AC13:AI13,\">0\")","v":0},{"$f":"IFERROR(AJ13/AK13,\"\")","v":""},"",""]
[null,null,{"$f":"IF(Настройки!C17=\"\",\"\",Настройки!C17)","v":""},"","","","","","","","","","","","","","","","","","","","","","","","","",{"$f":"IFERROR(AVERAGEIFS(тблОценкиПредмети[Резултат],тблОценкиПредмети[Предмет],Изчисления!$C14,тблОценкиПредмети[Тип],Изчисления!AC$5)*Настройки!E17,\"\")","v":""},{"$f":"IFERROR(AVERAGEIFS(тблОценкиПредмети[Резултат],тблОценкиПредмети[Предмет],Изчисления!$C14,тблОценкиПредмети[Тип],Изчисления!AD$5)*Настройки!F17,\"\")","v":""},{"$f":"IFERROR(AVERAGEIFS(тблОценкиПредмети[Резултат],тблОценкиПредмети[Предмет],Изчисления!$C14,тблОценкиПредмети[Тип],Изчисления!AE$5)*Настройки!G17,\"\")","v":""},{"$f":"IFERROR(AVERAGEIFS(тблОценкиПредмети[Резултат],тблОценкиПредмети[Предмет],Изчисления!$C14,тблОценкиПредмети[Тип],Изчисления!AF$5)*Настройки!H17,\"\")","v":""},{"$f":"IFERROR(AVERAGEIFS(тблОценкиПредмети[Резултат],тблОценкиПредмети[Предмет],Изчисления!$C14,тблОценкиПредмети[Тип],Изчисления!AG$5)*Настройки!I17,\"\")","v":""},{"$f":"IFERROR(AVERAGEIFS(тблОценкиПредмети[Резултат],тблОценкиПредмети[Предмет],Изчисления!$C14,тблОценкиПредмети[Тип],Изчисления!AH$5)*Настройки!J17,\"\")","v":""},{"$f":"IFERROR(AVERAGEIFS(тблОценкиПредмети[Резултат],тблОценкиПредмети[Предмет],Изчисления!$C14,тблОценкиПредмети[Тип],Изчисления!AI$5)*Настройки!K17,\"\")","v":""},0,{"$f":"SUMIFS(Настройки!E17:K17,Изчисления!AC14:AI14,\">0\")","v":0},"","",""]
[null,null,{"$f":"IF(Настройки!C18=\"\",\"\",Настройки!C18)","v":""},"","","","","","","","","","","","","","","","","","","","","","","","","",{"$f":"IFERROR(AVERAGEIFS(тблОценкиПредмети[Резултат],тблОценкиПредмети[Предмет],Изчисления!$C15,тблОценкиПредмети[Тип],Изчисления!AC$5)*Настройки!E18,\"\")","v":""},{"$f":"IFERROR(AVERAGEIFS(тблОценкиПредмети[Резултат],тблОценкиПредмети[Предмет],Изчисления!$C15,тблОценкиПредмети[Тип],Изчисления!AD$5)*Настройки!F18,\"\")","v":""},{"$f":"IFERROR(AVERAGEIFS(тблОценкиПредмети[Резултат],тблОценкиПредмети[Предмет],Изчисления!$C15,тблОценкиПредмети[Тип],Изчисления!AE$5)*Настройки!G18,\"\")","v":""},{"$f":"IFERROR(AVERAGEIFS(тблОценкиПредмети[Резултат],тблОценкиПредмети[Предмет],Изчисления!$C15,тблОценкиПредмети[Тип],Изчисления!AF$5)*Настройки!H18,\"\")","v":""},{"$f":"IFERROR(AVERAGEIFS(тблОценкиПредмети[Резултат],тблОценкиПредмети[Предмет],Изчисления!$C15,тблОценкиПредмети[Тип],Изчисления!AG$5)*Настройки!I18,\"\")","v":""},{"$f":"IFERROR(AVERAGEIFS(тблОценкиПредмети[Резултат],тблОценкиПредмети[Предмет],Изчисления!$C15,тблОценкиПредмети[Тип],Изчисления!AH$5)*Настройки!J18,\"\")","v":""},{"$f":"IFERROR(AVERAGEIFS(тблОценкиПредмети[Резултат],тблОценкиПредмети[Предмет],Изчисления!$C15,тблОценкиПредмети[Тип],Изчисления!AI$5)*Настройки!K18,\"\")","v":""},0,{"$f":"SUMIFS(Настройки!E18:K18,Изчисления!AC15:AI15,\">0\")","v":0},"","",""]
{"$rows_left_out":642}