{"text_format":"3","workbook":"xlsx","n_sheets":2,"sheets":["График за служител","Справка_ДниНаСедмицата"],"not_rendered":{"defined_names":27},"read":"whole","date_system":"1900"}

{"sheet":"График за служител","index":0,"n_rows":36,"n_cols":26,"rows_kept":36,"merged":[[0,1,2,4],[0,5,2,9],[0,10,2,14],[0,15,3,23],[0,24,3,24],[3,1,3,3],[3,5,3,9],[3,10,3,14],[4,1,6,3],[4,4,6,6],[5,14,7,14],[5,22,7,22],[5,23,7,23],[5,24,7,24],[21,1,21,6],[22,1,23,3],[22,4,23,6],[23,14,24,14],[23,22,24,22],[23,23,24,23],[23,24,24,24],[32,1,32,6],[32,24,33,24],[32,25,33,25],[33,1,33,6],[34,1,34,6],[35,1,35,3],[35,4,35,5],[35,6,35,7],[35,8,35,14],[35,15,35,16],[35,17,35,23]]}
[null,"ГРАФИК ЗА РАБОТАТА НА СЛУЖИТЕЛ",{"$nulls":3},"Име на служител",{"$nulls":9},"Изберете \"Да\" в клетка вдясно, ако има извънредни \nизисква се удостоверяване"]
[]
[]
[null,"Крайна дата на заплатата",null,null,{"$f":"V7","v":"2025-06-14"},"Номер на служител"]
[null,"РЕДОВНИ ЧАСОВЕ:",null,null,"Дата:"]
[{"$nulls":14},"Общо\nСедмица 1\nРедовни",{"$nulls":7},"Общо\nСедмица 2\nРедовни","Общо\nРедовни\nЧасове","Платежен код за използване само за разплащателната ведомост"]
[{"$nulls":7},"2025-06-01",{"$f":"Ден_Първи+1","v":"2025-06-02"},{"$f":"Ден_Първи+2","v":"2025-06-03"},{"$f":"Ден_Първи+3","v":"2025-06-04"},{"$f":"Ден_Първи+4","v":"2025-06-05"},{"$f":"Ден_Първи+5","v":"2025-06-06"},{"$f":"Ден_Първи+6","v":"2025-06-07"},null,{"$f":"Ден_Първи+7","v":"2025-06-08"},{"$f":"Ден_Първи+8","v":"2025-06-09"},{"$f":"Ден_Първи+9","v":"2025-06-10"},{"$f":"Ден_Първи+10","v":"2025-06-11"},{"$f":"Ден_Първи+11","v":"2025-06-12"},{"$f":"Ден_Първи+12","v":"2025-06-13"},{"$f":"Ден_Първи+13","v":"2025-06-14"}]
[null,"Задача","Loc","Служ. №","Описание на работата","Длъжност","Длъжност №",{"$f":"VLOOKUP(WEEKDAY(Ден_Първи),Справка_ДниНаСедмицата!$B$2:$C$8,2)","v":"Нед"},{"$f":"VLOOKUP(WEEKDAY(I7),Справка_ДниНаСедмицата!$B$2:$C$8,2)","v":"Пон"},{"$f":"VLOOKUP(WEEKDAY(J7),Справка_ДниНаСедмицата!$B$2:$C$8,2)","v":"Вто"},{"$f":"VLOOKUP(WEEKDAY(K7),Справка_ДниНаСедмицата!$B$2:$C$8,2)","v":"Сря"},{"$f":"VLOOKUP(WEEKDAY(L7),Справка_ДниНаСедмицата!$B$2:$C$8,2)","v":"Чет"},{"$f":"VLOOKUP(WEEKDAY(M7),Справка_ДниНаСедмицата!$B$2:$C$8,2)","v":"Пет"},{"$f":"VLOOKUP(WEEKDAY(N7),Справка_ДниНаСедмицата!$B$2:$C$8,2)","v":"Съб"},null,{"$f":"VLOOKUP(WEEKDAY(P7),Справка_ДниНаСедмицата!$B$2:$C$8,2)","v":"Нед"},{"$f":"VLOOKUP(WEEKDAY(Q7),Справка_ДниНаСедмицата!$B$2:$C$8,2)","v":"Пон"},{"$f":"VLOOKUP(WEEKDAY(R7),Справка_ДниНаСедмицата!$B$2:$C$8,2)","v":"Вто"},{"$f":"VLOOKUP(WEEKDAY(S7),Справка_ДниНаСедмицата!$B$2:$C$8,2)","v":"Сря"},{"$f":"VLOOKUP(WEEKDAY(T7),Справка_ДниНаСедмицата!$B$2:$C$8,2)","v":"Чет"},{"$f":"VLOOKUP(WEEKDAY(U7),Справка_ДниНаСедмицата!$B$2:$C$8,2)","v":"Пет"},{"$f":"VLOOKUP(WEEKDAY(V7),Справка_ДниНаСедмицата!$B$2:$C$8,2)","v":"Съб"}]
[{"$nulls":14},{"$f":"SUM(H9:N9)","v":{"v":0,"d":"0.00"}},{"$nulls":7},{"$f":"SUM(P9:V9)","v":{"v":0,"d":"0.00"}},{"$f":"O9+W9","v":{"v":0,"d":"0.00"}}]
[{"$nulls":14},{"v":0,"d":"0.00"},{"$nulls":7},{"v":0,"d":"0.00"},{"v":0,"d":"0.00"}]
[{"$nulls":14},{"v":0,"d":"0.00"},{"$nulls":7},{"v":0,"d":"0.00"},{"v":0,"d":"0.00"}]
[{"$nulls":14},{"v":0,"d":"0.00"},{"$nulls":7},{"v":0,"d":"0.00"},{"v":0,"d":"0.00"}]
[{"$nulls":14},{"v":0,"d":"0.00"},{"$nulls":7},{"v":0,"d":"0.00"},{"v":0,"d":"0.00"}]
[{"$nulls":14},{"v":0,"d":"0.00"},{"$nulls":7},{"v":0,"d":"0.00"},{"v":0,"d":"0.00"}]
[{"$nulls":14},{"v":0,"d":"0.00"},{"$nulls":7},{"v":0,"d":"0.00"},{"v":0,"d":"0.00"}]
[{"$nulls":14},{"$f":"SUM(H16:N16)","v":{"v":0,"d":"0.00"}},{"$nulls":7},{"$f":"SUM(P16:V16)","v":{"v":0,"d":"0.00"}},{"$f":"O16+W16","v":{"v":0,"d":"0.00"}}]
[{"$nulls":14},{"v":0,"d":"0.00"},{"$nulls":7},{"v":0,"d":"0.00"},{"v":0,"d":"0.00"}]
[{"$nulls":14},{"v":0,"d":"0.00"},{"$nulls":7},{"v":0,"d":"0.00"},{"v":0,"d":"0.00"}]
[{"$nulls":14},{"v":0,"d":"0.00"},{"$nulls":7},{"v":0,"d":"0.00"},{"v":0,"d":"0.00"}]
[{"$nulls":14},{"v":0,"d":"0.00"},{"$nulls":7},{"v":0,"d":"0.00"},{"v":0,"d":"0.00"}]
[{"$nulls":14},{"v":0,"d":"0.00"},{"$nulls":7},{"v":0,"d":"0.00"},{"v":0,"d":"0.00"}]
[null,"Общо редовни часове   ",{"$nulls":5},{"$f":"SUM(H9:H21)","v":{"v":0,"d":"0.00"}},{"v":0,"d":"0.00"},{"v":0,"d":"0.00"},{"v":0,"d":"0.00"},{"v":0,"d":"0.00"},{"v":0,"d":"0.00"},{"v":0,"d":"0.00"},{"v":0,"d":"0.00"},{"v":0,"d":"0.00"},{"$f":"SUM(Q9:Q21)","v":{"v":0,"d":"0.00"}},{"v":0,"d":"0.00"},{"v":0,"d":"0.00"},{"v":0,"d":"0.00"},{"v":0,"d":"0.00"},{"v":0,"d":"0.00"},{"$f":"SUM(W9:W21)","v":{"v":0,"d":"0.00"}},{"$f":"SUM(X9:X21)","v":{"v":0,"d":"0.00"}}]
[null,"ИЗВЪНРЕДНИ ЧАСОВЕ:",null,null,"Дата:"]
[{"$nulls":7},{"$f":"Ден_Първи","v":"2025-06-01"},{"$f":"Ден_Първи+1","v":"2025-06-02"},{"$f":"Ден_Първи+2","v":"2025-06-03"},{"$f":"Ден_Първи+3","v":"2025-06-04"},{"$f":"Ден_Първи+4","v":"2025-06-05"},{"$f":"Ден_Първи+5","v":"2025-06-06"},{"$f":"Ден_Първи+6","v":"2025-06-07"},"Седмица 1 Извънредни",{"$f":"Ден_Първи+7","v":"2025-06-08"},{"$f":"Ден_Първи+8","v":"2025-06-09"},{"$f":"Ден_Първи+9","v":"2025-06-10"},{"$f":"Ден_Първи+10","v":"2025-06-11"},{"$f":"Ден_Първи+11","v":"2025-06-12"},{"$f":"Ден_Първи+12","v":"2025-06-13"},{"$f":"Ден_Първи+13","v":"2025-06-14"},"Седмица 2 Извънредни","Общо извънредни","Извънредни\nкод"]
[null,"Задача","Loc","Служ. №","Описание на работата","Длъжност","Длъжност №",{"$f":"VLOOKUP(WEEKDAY(Ден_Първи),Справка_ДниНаСедмицата!$B$2:$C$8,2)","v":"Нед"},{"$f":"VLOOKUP(WEEKDAY(I24),Справка_ДниНаСедмицата!$B$2:$C$8,2)","v":"Пон"},{"$f":"VLOOKUP(WEEKDAY(J24),Справка_ДниНаСедмицата!$B$2:$C$8,2)","v":"Вто"},{"$f":"VLOOKUP(WEEKDAY(K24),Справка_ДниНаСедмицата!$B$2:$C$8,2)","v":"Сря"},{"$f":"VLOOKUP(WEEKDAY(L24),Справка_ДниНаСедмицата!$B$2:$C$8,2)","v":"Чет"},{"$f":"VLOOKUP(WEEKDAY(M24),Справка_ДниНаСедмицата!$B$2:$C$8,2)","v":"Пет"},{"$f":"VLOOKUP(WEEKDAY(N24),Справка_ДниНаСедмицата!$B$2:$C$8,2)","v":"Съб"},null,{"$f":"VLOOKUP(WEEKDAY(P24),Справка_ДниНаСедмицата!$B$2:$C$8,2)","v":"Нед"},{"$f":"VLOOKUP(WEEKDAY(Q24),Справка_ДниНаСедмицата!$B$2:$C$8,2)","v":"Пон"},{"$f":"VLOOKUP(WEEKDAY(R24),Справка_ДниНаСедмицата!$B$2:$C$8,2)","v":"Вто"},{"$f":"VLOOKUP(WEEKDAY(S24),Справка_ДниНаСедмицата!$B$2:$C$8,2)","v":"Сря"},{"$f":"VLOOKUP(WEEKDAY(T24),Справка_ДниНаСедмицата!$B$2:$C$8,2)","v":"Чет"},{"$f":"VLOOKUP(WEEKDAY(U24),Справка_ДниНаСедмицата!$B$2:$C$8,2)","v":"Пет"},{"$f":"VLOOKUP(WEEKDAY(V24),Справка_ДниНаСедмицата!$B$2:$C$8,2)","v":"Съб"}]
[{"$nulls":14},{"$f":"SUM(H26:N26)","v":{"v":0,"d":"0.00"}},{"$nulls":7},{"$f":"SUM(P26:V26)","v":{"v":0,"d":"0.00"}},{"$f":"O26+W26","v":{"v":0,"d":"0.00"}}]
[{"$nulls":14},{"v":0,"d":"0.00"},{"$nulls":7},{"v":0,"d":"0.00"},{"v":0,"d":"0.00"}]
[{"$nulls":14},{"v":0,"d":"0.00"},{"$nulls":7},{"v":0,"d":"0.00"},{"v":0,"d":"0.00"}]
[{"$nulls":14},{"v":0,"d":"0.00"},{"$nulls":7},{"v":0,"d":"0.00"},{"v":0,"d":"0.00"}]
[{"$nulls":14},{"v":0,"d":"0.00"},{"$nulls":7},{"v":0,"d":"0.00"},{"v":0,"d":"0.00"}]
[{"$nulls":14},{"v":0,"d":"0.00"},{"$nulls":7},{"v":0,"d":"0.00"},{"v":0,"d":"0.00"}]
[{"$nulls":14},{"v":0,"d":"0.00"},{"$nulls":7},{"v":0,"d":"0.00"},{"v":0,"d":"0.00"}]
[null,"Общо извънредни часове     ",{"$nulls":5},{"$f":"SUM(H26:H32)","v":{"v":0,"d":"0.00"}},{"v":0,"d":"0.00"},{"v":0,"d":"0.00"},{"v":0,"d":"0.00"},{"v":0,"d":"0.00"},{"v":0,"d":"0.00"},{"v":0,"d":"0.00"},{"$f":"SUM(O26:O32)","v":{"v":0,"d":"0.00"}},{"v":0,"d":"0.00"},{"v":0,"d":"0.00"},{"v":0,"d":"0.00"},{"v":0,"d":"0.00"},{"v":0,"d":"0.00"},{"v":0,"d":"0.00"},{"v":0,"d":"0.00"},{"$f":"SUM(P33:V33)","v":{"v":0,"d":"0.00"}},{"$f":"SUM(X26:X32)","v":{"v":0,"d":"0.00"}},"Общо\nЧасове\nИзработени","Общо\nЧасове\nПлатени"]
[null,"Компенсация на извънредните     ",{"$nulls":12},{"$f":"IF(SUM(H34:N34)<=O33,SUM(H34:N34),O33)","v":{"v":0,"d":"0.00"}},{"$nulls":7},{"$f":"IF(SUM(P34:V34)<=W33,SUM(P34:V34),W33)","v":{"v":0,"d":"0.00"}},{"$f":"IF(SUM(Q34:W34)<=X33,SUM(Q34:W34),X33)","v":{"v":0,"d":"0.00"}}]
[null,"Платени извънредни     ",{"$nulls":5},{"$f":"IF(H33>=H34,H33-H34,H33)","v":{"v":0,"d":"0.00"}},{"$f":"IF(I33>=I34,I33-I34,I33)","v":{"v":0,"d":"0.00"}},{"v":0,"d":"0.00"},{"v":0,"d":"0.00"},{"v":0,"d":"0.00"},{"v":0,"d":"0.00"},{"v":0,"d":"0.00"},{"v":0,"d":"0.00"},{"v":0,"d":"0.00"},{"v":0,"d":"0.00"},{"v":0,"d":"0.00"},{"v":0,"d":"0.00"},{"v":0,"d":"0.00"},{"v":0,"d":"0.00"},{"v":0,"d":"0.00"},{"$f":"IF(W33>=W34,W33-W34,W33)","v":{"v":0,"d":"0.00"}},{"$f":"IF(X33>=X34,X33-X34,X33)","v":{"v":0,"d":"0.00"}},{"$f":"$X$22+$X$33","v":{"v":0,"d":"0.00"}},{"$f":"X22+X35","v":{"v":0,"d":"0.00"}}]
[null,"Служител ",{"$nulls":4},"Ръководител ",{"$nulls":8},"Ръководител "]

{"sheet":"Справка_ДниНаСедмицата","index":1,"n_rows":8,"n_cols":3,"rows_kept":8}
[null,"Ден от седмицата\nЦяло число","Ден от седмицата\nИнициали"]
[null,1,"Нед"]
[null,2,"Пон"]
[null,3,"Вто"]
[null,4,"Сря"]
[null,5,"Чет"]
[null,6,"Пет"]
[null,7,"Съб"]