{"text_format":"3","workbook":"xlsx","n_sheets":4,"sheets":["Финансов отчет","Въвеждане на финансови данни","Настройки на ключовата метрика","Изчисления"],"not_rendered":{"defined_names":5},"read":"whole","date_system":"1900"}

{"sheet":"Финансов отчет","index":0,"n_rows":40,"n_cols":14,"rows_kept":40,"merged":[[1,10,1,11],[6,9,6,11],[7,9,7,11],[8,9,8,11],[9,9,9,11],[12,3,12,7],[14,8,14,11],[15,8,15,11],[16,8,16,11],[17,8,17,11],[18,8,18,11],[19,8,19,11],[20,8,20,11],[21,8,21,11],[22,8,22,11],[23,8,23,11],[24,8,24,11],[25,8,25,11],[26,8,26,11],[27,8,27,11],[28,8,28,11],[29,8,29,11],[30,8,30,11],[31,8,31,11],[32,8,32,11],[33,8,33,11],[34,8,34,11],[35,8,35,11],[36,8,36,11],[37,8,37,11],[38,8,38,11],[39,8,39,11]]}
[]
[null,"ГОДИШЕН ФИНАНСОВ ОТЧЕТ",{"$nulls":8},2016,null,null,"Изберете година за отчета в клетка L2"]
[null,"ИМЕТО НА ВАШАТА ФИРМА",{"$nulls":11},"За да редактирате данните, изберете листа \"Въвеждане на финансови данни\""]
[]
[null,"КЛЮЧОВИ МЕТРИКИ",null,"Щракнете, за да промените ключовите метрики на отчета"]
[]
[null,{"$f":"Изчисления!B8","v":"ПРИХОДИ"},null,{"$f":"Изчисления!B9","v":"НЕТНА ПЕЧАЛБА"},null,{"$f":"Изчисления!B10","v":"ЛИХВА"},null,{"$f":"Изчисления!B11","v":"АМОРТИЗАЦИЯ"},null,{"$f":"Изчисления!B12","v":"ПЕЧАЛБА ОТ ДЕЙНОСТТА"}]
[null,{"$f":"IFERROR(Изчисления!G8,\"\")","v":{"v":180583.88,"d":"180,584 лв."}},null,{"$f":"IFERROR(Изчисления!G9,\"\")","v":{"v":67474.85,"d":"67,475 лв."}},null,{"$f":"IFERROR(Изчисления!G10,\"\")","v":{"v":3789.47,"d":"3,789 лв."}},null,{"$f":"IFERROR(Изчисления!G11,\"\")","v":{"v":5546.88,"d":"5,547 лв."}},null,{"$f":"IFERROR(Изчисления!G12,\"\")","v":{"v":73425.99,"d":"73,426 лв."}}]
[null,{"$f":"Изчисления!H8","v":{"v":3.0953753897409175E-3,"d":"0%"}},null,{"$f":"Изчисления!H9","v":{"v":0.018148662861143583,"d":"2%"}},null,{"$f":"Изчисления!H10","v":{"v":0.1351496270556869,"d":"14%"}},null,{"$f":"Изчисления!H11","v":{"v":0.09440022728976682,"d":"9%"}},null,{"$f":"Изчисления!H12","v":{"v":-0.05033560822904626,"d":"-5%"}}]
[]
[]
[]
[null,"ВСИЧКИ МЕТРИКИ",null,"Не променяйте информацията по-долу. Щракнете, за да въведете финансови данни"]
[]
[null,"МЕТРИКА",null,{"$f":"\"ГОДИНА НА ОТЧЕТА (\"&SelectedYear&\")\"","v":"ГОДИНА НА ОТЧЕТА (2016)"},null,{"$f":"\"ПРЕДХОДНА ГОДИНА (\"&SelectedYear-1&\")\"","v":"ПРЕДХОДНА ГОДИНА (2015)"},null,"% НА ПРОМЯНА",{"$f":"CONCATENATE(Години,\"-ГОДИШНА ТЕНДЕНЦИЯ\")","v":"5-ГОДИШНА ТЕНДЕНЦИЯ"}]
[null,{"$f":"Изчисления!B15","v":"ПРИХОДИ"},null,{"$f":"IF($B16=\"\",\"\",Изчисления!G15)","v":{"v":180583.88,"d":"180,583.88 лв."}},null,{"$f":"IF($B16=\"\",\"\",Изчисления!F15)","v":{"v":180026.63,"d":"180,026.63 лв."}},null,{"$f":"IFERROR(D16/F16-1,\"\")","v":{"v":3.0953753897409175E-3,"d":"0%"}}]
[null,{"$f":"Изчисления!B16","v":"РАЗХОДИ ЗА ДЕЙНОСТТА"},null,{"$f":"IF($B17=\"\",\"\",Изчисления!G16)","v":{"v":94419.45,"d":"94,419.45 лв."}},null,{"$f":"IF($B17=\"\",\"\",Изчисления!F16)","v":{"v":80883.33,"d":"80,883.33 лв."}},null,{"v":0.16735364382252804,"d":"17%"}]
[null,{"$f":"Изчисления!B17","v":"ПЕЧАЛБА ОТ ДЕЙНОСТТА"},null,{"$f":"IF($B18=\"\",\"\",Изчисления!G17)","v":{"v":73425.99,"d":"73,425.99 лв."}},null,{"$f":"IF($B18=\"\",\"\",Изчисления!F17)","v":{"v":77317.83,"d":"77,317.83 лв."}},null,{"v":-0.05033560822904626,"d":"-5%"}]
[null,{"$f":"Изчисления!B18","v":"АМОРТИЗАЦИЯ"},null,{"$f":"IF($B19=\"\",\"\",Изчисления!G18)","v":{"v":5546.88,"d":"5,546.88 лв."}},null,{"$f":"IF($B19=\"\",\"\",Изчисления!F18)","v":{"v":5068.42,"d":"5,068.42 лв."}},null,{"v":0.09440022728976682,"d":"9%"}]
[null,{"$f":"Изчисления!B19","v":"ЛИХВА"},null,{"$f":"IF($B20=\"\",\"\",Изчисления!G19)","v":{"v":3789.47,"d":"3,789.47 лв."}},null,{"$f":"IF($B20=\"\",\"\",Изчисления!F19)","v":{"v":3338.3,"d":"3,338.30 лв."}},null,{"v":0.1351496270556869,"d":"14%"}]
{"$rows_left_out":21}
{"sheet":"Въвеждане на финансови данни","index":1,"n_rows":19,"n_cols":9,"rows_kept":19}
[]
[null,"ВЪВЕДЕТЕ СВОИТЕ ФИНАНСОВИ ДАННИ"]
[null," МОЖЕТЕ ДА ЗАДАДЕТЕ ДО 25 КЛЮЧОВИ МЕТРИКИ ЗА 7 ГОДИНИ"]
[null," Щракнете, за да прегледате финансовия отчет"]
[null,"ИМЕ НА МЕТРИКАТА",2010,2011,2012,2013,2014,2015,2016]
[null,"ПРИХОДИ",{"v":125000,"d":"125,000.00 лв."},{"v":134137.45,"d":"134,137.45 лв."},{"v":142728.38,"d":"142,728.38 лв."},{"v":150687.46,"d":"150,687.46 лв."},{"v":165044.56,"d":"165,044.56 лв."},{"v":180026.63,"d":"180,026.63 лв."},{"v":180583.88,"d":"180,583.88 лв."}]
[null,"РАЗХОДИ ЗА ДЕЙНОСТТА",{"v":65000,"d":"65,000.00 лв."},{"v":70962.31,"d":"70,962.31 лв."},{"v":75924.86,"d":"75,924.86 лв."},{"v":78901.27,"d":"78,901.27 лв."},{"v":81674.37,"d":"81,674.37 лв."},{"v":80883.33,"d":"80,883.33 лв."},{"v":94419.45,"d":"94,419.45 лв."}]
[null,"ПЕЧАЛБА ОТ ДЕЙНОСТТА",{"v":60000,"d":"60,000.00 лв."},{"v":64207.3,"d":"64,207.30 лв."},{"v":68857.69,"d":"68,857.69 лв."},{"v":75643.25,"d":"75,643.25 лв."},{"v":76755.26,"d":"76,755.26 лв."},{"v":77317.83,"d":"77,317.83 лв."},{"v":73425.99,"d":"73,425.99 лв."}]
[null,"АМОРТИЗАЦИЯ",{"v":4500,"d":"4,500.00 лв."},{"v":4517.77,"d":"4,517.77 лв."},{"v":4656.92,"d":"4,656.92 лв."},{"v":4974.21,"d":"4,974.21 лв."},{"v":5024.11,"d":"5,024.11 лв."},{"v":5068.42,"d":"5,068.42 лв."},{"v":5546.88,"d":"5,546.88 лв."}]
[null,"ЛИХВА",{"v":2500,"d":"2,500.00 лв."},{"v":2745.82,"d":"2,745.82 лв."},{"v":2893.11,"d":"2,893.11 лв."},{"v":3136.12,"d":"3,136.12 лв."},{"v":3148.53,"d":"3,148.53 лв."},{"v":3338.3,"d":"3,338.30 лв."},{"v":3789.47,"d":"3,789.47 лв."}]
[null,"НЕТНА ПЕЧАЛБА",{"v":54000,"d":"54,000.00 лв."},{"v":54761.075,"d":"54,761.08 лв."},{"v":55860.81,"d":"55,860.81 лв."},{"v":59747.95,"d":"59,747.95 лв."},{"v":61483.59,"d":"61,483.59 лв."},{"v":66272.1,"d":"66,272.10 лв."},{"v":67474.85,"d":"67,474.85 лв."}]
[null,"ДАНЪЦИ",{"v":22000,"d":"22,000.00 лв."},{"v":23920.54,"d":"23,920.54 лв."},{"v":25576.74,"d":"25,576.74 лв."},{"v":27498.86,"d":"27,498.86 лв."},{"v":28335.67,"d":"28,335.67 лв."},{"v":29424.53,"d":"29,424.53 лв."},{"v":31408.25,"d":"31,408.25 лв."}]
[null,"ПЕЧАЛБА СЛЕД ДАНЪЦИ",{"v":32000,"d":"32,000.00 лв."},{"v":34943.49,"d":"34,943.49 лв."},{"v":38418.53,"d":"38,418.53 лв."},{"v":39895.05,"d":"39,895.05 лв."},{"v":40607.73,"d":"40,607.73 лв."},{"v":42438.2,"d":"42,438.20 лв."},{"v":50247.68,"d":"50,247.68 лв."}]
[null,"МЕТРИКА 1",{"v":12.8,"d":"12.80 лв."},{"v":12.81,"d":"12.81 лв."},{"v":13.78,"d":"13.78 лв."},{"v":14.29,"d":"14.29 лв."},{"v":15.57,"d":"15.57 лв."},{"v":16.78,"d":"16.78 лв."},{"v":19.96,"d":"19.96 лв."}]
[null,"МЕТРИКА 2",{"v":18.2,"d":"18.20 лв."},{"v":18.59,"d":"18.59 лв."},{"v":19.22,"d":"19.22 лв."},{"v":20.17,"d":"20.17 лв."},{"v":20.48,"d":"20.48 лв."},{"v":21.84,"d":"21.84 лв."},{"v":26.01,"d":"26.01 лв."}]
[null,"МЕТРИКА 3",{"v":19.1,"d":"19.10 лв."},{"v":20.55,"d":"20.55 лв."},{"v":21.87,"d":"21.87 лв."},{"v":23.19,"d":"23.19 лв."},{"v":24.67,"d":"24.67 лв."},{"v":26.39,"d":"26.39 лв."},{"v":31.08,"d":"31.08 лв."}]
[null,"МЕТРИКА 4",{"v":12.1,"d":"12.10 лв."},{"v":12.21,"d":"12.21 лв."},{"v":12.59,"d":"12.59 лв."},{"v":13.7,"d":"13.70 лв."},{"v":13.76,"d":"13.76 лв."},{"v":14.59,"d":"14.59 лв."},{"v":14.92,"d":"14.92 лв."}]
[null,"МЕТРИКА 5",{"v":0.75,"d":"0.75 лв."},{"v":0.79,"d":"0.79 лв."},{"v":0.85,"d":"0.85 лв."},{"v":0.89,"d":"0.89 лв."},{"v":0.91,"d":"0.91 лв."},{"v":1,"d":"1.00 лв."},{"v":1.03,"d":"1.03 лв."}]
[null,"МЕТРИКА 6",{"v":0.23,"d":"0.23 лв."},{"v":0.25,"d":"0.25 лв."},{"v":0.27,"d":"0.27 лв."},{"v":0.28,"d":"0.28 лв."},{"v":0.29,"d":"0.29 лв."},{"v":0.3,"d":"0.30 лв."},{"v":0.34,"d":"0.34 лв."}]

{"sheet":"Настройки на ключовата метрика","index":2,"n_rows":9,"n_cols":5,"rows_kept":9,"merged":[[3,1,3,3]]}
[]
[null,"ДЕФИНИРАЙТЕ КЛЮЧОВИТЕ МЕТРИКИ ТУК"]
[null," ИЗБЕРЕТЕ ДО 5 КЛЮЧОВИ МЕТРИКИ, КОИТО ДА СЕ ПОКАЗВАТ В ГОРНАТА ЧАСТ НА ОТЧЕТА"]
[null,"  Щракнете, за да прегледате финансовия отчет"]
[null,1,"ПРИХОДИ",null,{"$f":"IF(ISBLANK(C5),\"← Изберете стойност от падащия списък\",IF(COUNTIF($C$5:C5,C5)>1,\"Избрали сте \"&C5&\" повече от един път.\",\"\"))","v":""}]
[null,2,"НЕТНА ПЕЧАЛБА",null,{"$f":"IF(ISBLANK(C6),\"← Изберете стойност от падащия списък\",IF(COUNTIF($C$5:C6,C6)>1,\"Избрали сте \"&C6&\" повече от един път.\",\"\"))","v":""}]
[null,3,"ЛИХВА",null,{"$f":"IF(ISBLANK(C7),\"← Изберете стойност от падащия списък\",IF(COUNTIF($C$5:C7,C7)>1,\"Избрали сте \"&C7&\" повече от един път.\",\"\"))","v":""}]
[null,4,"АМОРТИЗАЦИЯ",null,{"$f":"IF(ISBLANK(C8),\"← Изберете стойност от падащия списък\",IF(COUNTIF($C$5:C8,C8)>1,\"Избрали сте \"&C8&\" повече от един път.\",\"\"))","v":""}]
[null,5,"ПЕЧАЛБА ОТ ДЕЙНОСТТА",null,{"$f":"IF(ISBLANK(C9),\"← Изберете стойност от падащия списък\",IF(COUNTIF($C$5:C9,C9)>1,\"Избрали сте \"&C9&\" повече от един път.\",\"\"))","v":""}]

{"sheet":"Изчисления","index":3,"n_rows":39,"n_cols":9,"rows_kept":39,"hidden":true}
["Този работен лист се използва за изчисляване на финансовия отчет и трябва да остане скрит."]
[{"$nulls":3},"Позиция"]
[null,"Тази година",{"$f":"SelectedYear","v":2016},{"$f":"MATCH(C3,lstYears,0)+1","v":8}]
[null,"Предходна година",{"$f":"C3-1","v":2015},{"$f":"MATCH(C4,lstYears,0)+1","v":7}]
[]
[null,"Позиция",{"$f":"MATCH(C7,lstYears,0)+1","v":4},{"$f":"MATCH(D7,lstYears,0)+1","v":5},{"$f":"MATCH(E7,lstYears,0)+1","v":6},{"$f":"MATCH(F7,lstYears,0)+1","v":7},{"$f":"MATCH(G7,lstYears,0)+1","v":8},null,{"$f":"COUNT(C6:G6)","v":5}]
[null,"Ключови метрики",{"$f":"D7-1","v":2012},{"$f":"E7-1","v":2013},{"$f":"F7-1","v":2014},{"$f":"G7-1","v":2015},{"$f":"C3","v":2016}]
[{"$f":"MATCH(B8,'Въвеждане на финансови данни'!$B$6:$B$30,0)","v":1},{"$f":"IF('Настройки на ключовата метрика'!C5=\"\",\"\",'Настройки на ключовата метрика'!C5)","v":"ПРИХОДИ"},{"$f":"IFERROR(INDEX('Въвеждане на финансови данни'!$B$6:$I$30,$A8,C$6),NA())","v":142728.38},{"$f":"IFERROR(INDEX('Въвеждане на финансови данни'!$B$6:$I$30,$A8,D$6),NA())","v":150687.46},{"$f":"IFERROR(INDEX('Въвеждане на финансови данни'!$B$6:$I$30,$A8,E$6),NA())","v":165044.56},{"$f":"IFERROR(INDEX('Въвеждане на финансови данни'!$B$6:$I$30,$A8,F$6),NA())","v":180026.63},{"$f":"IFERROR(INDEX('Въвеждане на финансови данни'!$B$6:$I$30,$A8,G$6),NA())","v":180583.88},{"$f":"IFERROR(G8/F8-1,\"\")","v":{"v":3.0953753897409175E-3,"d":"0%"}}]
[{"$f":"MATCH(B9,'Въвеждане на финансови данни'!$B$6:$B$30,0)","v":6},{"$f":"IF('Настройки на ключовата метрика'!C6=\"\",\"\",'Настройки на ключовата метрика'!C6)","v":"НЕТНА ПЕЧАЛБА"},{"$f":"IFERROR(INDEX('Въвеждане на финансови данни'!$B$6:$I$30,$A9,C$6),NA())","v":55860.81},{"$f":"IFERROR(INDEX('Въвеждане на финансови данни'!$B$6:$I$30,$A9,D$6),NA())","v":59747.95},{"$f":"IFERROR(INDEX('Въвеждане на финансови данни'!$B$6:$I$30,$A9,E$6),NA())","v":61483.59},{"$f":"IFERROR(INDEX('Въвеждане на финансови данни'!$B$6:$I$30,$A9,F$6),NA())","v":66272.1},{"$f":"IFERROR(INDEX('Въвеждане на финансови данни'!$B$6:$I$30,$A9,G$6),NA())","v":67474.85},{"$f":"IFERROR(G9/F9-1,\"\")","v":{"v":0.018148662861143583,"d":"2%"}}]
[{"$f":"MATCH(B10,'Въвеждане на финансови данни'!$B$6:$B$30,0)","v":5},{"$f":"IF('Настройки на ключовата метрика'!C7=\"\",\"\",'Настройки на ключовата метрика'!C7)","v":"ЛИХВА"},{"$f":"IFERROR(INDEX('Въвеждане на финансови данни'!$B$6:$I$30,$A10,C$6),NA())","v":2893.11},{"$f":"IFERROR(INDEX('Въвеждане на финансови данни'!$B$6:$I$30,$A10,D$6),NA())","v":3136.12},{"$f":"IFERROR(INDEX('Въвеждане на финансови данни'!$B$6:$I$30,$A10,E$6),NA())","v":3148.53},{"$f":"IFERROR(INDEX('Въвеждане на финансови данни'!$B$6:$I$30,$A10,F$6),NA())","v":3338.3},{"$f":"IFERROR(INDEX('Въвеждане на финансови данни'!$B$6:$I$30,$A10,G$6),NA())","v":3789.47},{"v":0.1351496270556869,"d":"14%"}]
[{"$f":"MATCH(B11,'Въвеждане на финансови данни'!$B$6:$B$30,0)","v":4},{"$f":"IF('Настройки на ключовата метрика'!C8=\"\",\"\",'Настройки на ключовата метрика'!C8)","v":"АМОРТИЗАЦИЯ"},{"$f":"IFERROR(INDEX('Въвеждане на финансови данни'!$B$6:$I$30,$A11,C$6),NA())","v":4656.92},{"$f":"IFERROR(INDEX('Въвеждане на финансови данни'!$B$6:$I$30,$A11,D$6),NA())","v":4974.21},{"$f":"IFERROR(INDEX('Въвеждане на финансови данни'!$B$6:$I$30,$A11,E$6),NA())","v":5024.11},{"$f":"IFERROR(INDEX('Въвеждане на финансови данни'!$B$6:$I$30,$A11,F$6),NA())","v":5068.42},{"$f":"IFERROR(INDEX('Въвеждане на финансови данни'!$B$6:$I$30,$A11,G$6),NA())","v":5546.88},{"v":0.09440022728976682,"d":"9%"}]
[{"$f":"MATCH(B12,'Въвеждане на финансови данни'!$B$6:$B$30,0)","v":3},{"$f":"IF('Настройки на ключовата метрика'!C9=\"\",\"\",'Настройки на ключовата метрика'!C9)","v":"ПЕЧАЛБА ОТ ДЕЙНОСТТА"},{"$f":"IFERROR(INDEX('Въвеждане на финансови данни'!$B$6:$I$30,$A12,C$6),NA())","v":68857.69},{"$f":"IFERROR(INDEX('Въвеждане на финансови данни'!$B$6:$I$30,$A12,D$6),NA())","v":75643.25},{"$f":"IFERROR(INDEX('Въвеждане на финансови данни'!$B$6:$I$30,$A12,E$6),NA())","v":76755.26},{"$f":"IFERROR(INDEX('Въвеждане на финансови данни'!$B$6:$I$30,$A12,F$6),NA())","v":77317.83},{"$f":"IFERROR(INDEX('Въвеждане на финансови данни'!$B$6:$I$30,$A12,G$6),NA())","v":73425.99},{"v":-0.05033560822904626,"d":"-5%"}]
[]
[null,"Всички метрики (работи с до 25 метрики)"]
[{"$f":"ROWS($B$15:B15)","v":1},{"$f":"IF('Въвеждане на финансови данни'!B6=0,\"\",'Въвеждане на финансови данни'!B6)","v":"ПРИХОДИ"},{"$f":"IF(B15=\"\",NA(),IFERROR(INDEX('Въвеждане на финансови данни'!$B$6:$I$30,$A15,C$6),NA()))","v":142728.38},{"$f":"IF(B15=\"\",NA(),IFERROR(INDEX('Въвеждане на финансови данни'!$B$6:$I$30,$A15,D$6),NA()))","v":150687.46},{"$f":"IF(B15=\"\",NA(),IFERROR(INDEX('Въвеждане на финансови данни'!$B$6:$I$30,$A15,E$6),NA()))","v":165044.56},{"$f":"IF(B15=\"\",NA(),IFERROR(INDEX('Въвеждане на финансови данни'!$B$6:$I$30,$A15,F$6),NA()))","v":180026.63},{"$f":"IF(B15=\"\",NA(),IFERROR(INDEX('Въвеждане на финансови данни'!$B$6:$I$30,$A15,G$6),NA()))","v":180583.88}]
[{"$f":"ROWS($B$15:B16)","v":2},{"$f":"IF('Въвеждане на финансови данни'!B7=0,\"\",'Въвеждане на финансови данни'!B7)","v":"РАЗХОДИ ЗА ДЕЙНОСТТА"},{"$f":"IF(B16=\"\",NA(),IFERROR(INDEX('Въвеждане на финансови данни'!$B$6:$I$30,$A16,C$6),NA()))","v":75924.86},{"$f":"IF(B16=\"\",NA(),IFERROR(INDEX('Въвеждане на финансови данни'!$B$6:$I$30,$A16,D$6),NA()))","v":78901.27},{"$f":"IF(B16=\"\",NA(),IFERROR(INDEX('Въвеждане на финансови данни'!$B$6:$I$30,$A16,E$6),NA()))","v":81674.37},{"$f":"IF(B16=\"\",NA(),IFERROR(INDEX('Въвеждане на финансови данни'!$B$6:$I$30,$A16,F$6),NA()))","v":80883.33},{"$f":"IF(B16=\"\",NA(),IFERROR(INDEX('Въвеждане на финансови данни'!$B$6:$I$30,$A16,G$6),NA()))","v":94419.45}]
[{"$f":"ROWS($B$15:B17)","v":3},{"$f":"IF('Въвеждане на финансови данни'!B8=0,\"\",'Въвеждане на финансови данни'!B8)","v":"ПЕЧАЛБА ОТ ДЕЙНОСТТА"},{"$f":"IF(B17=\"\",NA(),IFERROR(INDEX('Въвеждане на финансови данни'!$B$6:$I$30,$A17,C$6),NA()))","v":68857.69},{"$f":"IF(B17=\"\",NA(),IFERROR(INDEX('Въвеждане на финансови данни'!$B$6:$I$30,$A17,D$6),NA()))","v":75643.25},{"$f":"IF(B17=\"\",NA(),IFERROR(INDEX('Въвеждане на финансови данни'!$B$6:$I$30,$A17,E$6),NA()))","v":76755.26},{"$f":"IF(B17=\"\",NA(),IFERROR(INDEX('Въвеждане на финансови данни'!$B$6:$I$30,$A17,F$6),NA()))","v":77317.83},{"$f":"IF(B17=\"\",NA(),IFERROR(INDEX('Въвеждане на финансови данни'!$B$6:$I$30,$A17,G$6),NA()))","v":73425.99}]
[{"$f":"ROWS($B$15:B18)","v":4},{"$f":"IF('Въвеждане на финансови данни'!B9=0,\"\",'Въвеждане на финансови данни'!B9)","v":"АМОРТИЗАЦИЯ"},{"$f":"IF(B18=\"\",NA(),IFERROR(INDEX('Въвеждане на финансови данни'!$B$6:$I$30,$A18,C$6),NA()))","v":4656.92},{"$f":"IF(B18=\"\",NA(),IFERROR(INDEX('Въвеждане на финансови данни'!$B$6:$I$30,$A18,D$6),NA()))","v":4974.21},{"$f":"IF(B18=\"\",NA(),IFERROR(INDEX('Въвеждане на финансови данни'!$B$6:$I$30,$A18,E$6),NA()))","v":5024.11},{"$f":"IF(B18=\"\",NA(),IFERROR(INDEX('Въвеждане на финансови данни'!$B$6:$I$30,$A18,F$6),NA()))","v":5068.42},{"$f":"IF(B18=\"\",NA(),IFERROR(INDEX('Въвеждане на финансови данни'!$B$6:$I$30,$A18,G$6),NA()))","v":5546.88}]
[{"$f":"ROWS($B$15:B19)","v":5},{"$f":"IF('Въвеждане на финансови данни'!B10=0,\"\",'Въвеждане на финансови данни'!B10)","v":"ЛИХВА"},{"$f":"IF(B19=\"\",NA(),IFERROR(INDEX('Въвеждане на финансови данни'!$B$6:$I$30,$A19,C$6),NA()))","v":2893.11},{"$f":"IF(B19=\"\",NA(),IFERROR(INDEX('Въвеждане на финансови данни'!$B$6:$I$30,$A19,D$6),NA()))","v":3136.12},{"$f":"IF(B19=\"\",NA(),IFERROR(INDEX('Въвеждане на финансови данни'!$B$6:$I$30,$A19,E$6),NA()))","v":3148.53},{"$f":"IF(B19=\"\",NA(),IFERROR(INDEX('Въвеждане на финансови данни'!$B$6:$I$30,$A19,F$6),NA()))","v":3338.3},{"$f":"IF(B19=\"\",NA(),IFERROR(INDEX('Въвеждане на финансови данни'!$B$6:$I$30,$A19,G$6),NA()))","v":3789.47}]
[{"$f":"ROWS($B$15:B20)","v":6},{"$f":"IF('Въвеждане на финансови данни'!B11=0,\"\",'Въвеждане на финансови данни'!B11)","v":"НЕТНА ПЕЧАЛБА"},{"$f":"IF(B20=\"\",NA(),IFERROR(INDEX('Въвеждане на финансови данни'!$B$6:$I$30,$A20,C$6),NA()))","v":55860.81},{"$f":"IF(B20=\"\",NA(),IFERROR(INDEX('Въвеждане на финансови данни'!$B$6:$I$30,$A20,D$6),NA()))","v":59747.95},{"$f":"IF(B20=\"\",NA(),IFERROR(INDEX('Въвеждане на финансови данни'!$B$6:$I$30,$A20,E$6),NA()))","v":61483.59},{"$f":"IF(B20=\"\",NA(),IFERROR(INDEX('Въвеждане на финансови данни'!$B$6:$I$30,$A20,F$6),NA()))","v":66272.1},{"$f":"IF(B20=\"\",NA(),IFERROR(INDEX('Въвеждане на финансови данни'!$B$6:$I$30,$A20,G$6),NA()))","v":67474.85}]
{"$rows_left_out":19}