{"text_format":"3","workbook":"xlsx","n_sheets":4,"sheets":["البدء","معلمات المشروع","تفاصيل المشروع","إجماليات المشروع"],"not_rendered":{"charts":2,"defined_names":3,"pivot_tables":1},"read":"whole","date_system":"1900"}

{"sheet":"البدء","index":0,"n_rows":7,"n_cols":2,"rows_kept":7}
[null,"حول هذا القالب"]
[null,"تعقب معلمات المشروع، وتفاصيل المشروع، وإجماليات المشروع في هذا المصنف \"متعقب التخطيط لحدث\"."]
[null,"أدخل المعلومات في ورقة عمل معلمات المشروع لتحديث المخططات العمودية، وفي ورقة عمل تفاصيل المشروع. يتم تحديث PivotTable في ورقة عمل إجماليات المشروع تلقائياً."]
[null,"املأ اسم الشركة في ورقة عمل المعلمات وسيتم تحديثه تلقائياً في أوراق العمل الأخرى."]
[null,"ملاحظة:  "]
[null,"تم توفير إرشادات إضافية في العمود A من كل ورقة عمل في مصنف \"متعقب التخطيط لحدث\". تم إخفاء هذا النص عن قصد. لإزالة النص، حدد العمود A، ثم حدد \"حذف\". لإظهار النص، حدد العمود A، ثم قم بتغيير لون الخط."]
[null,"لمعرفة المزيد حول الجداول في أوراق العمل، اضغط على مفتاح SHIFT ومن ثم F10 داخل جدول، وحدّد الخيار \"جدول\"، ثم حدّد \"النص البديل\"."]

{"sheet":"معلمات المشروع","index":1,"n_rows":24,"n_cols":9,"rows_kept":24,"merged":[[23,1,42,3]]}
["أنشئ معلمات المشروع في ورقة العمل هذه. أدخل \"اسم الشركة\" في الخلية الموجودة على اليسار. وتوجد إرشادات مفيدة في الخلايا الموجودة في هذا العمود. السهم لأسفل لبدء الاستخدام.","اسم الشركة"]
["يوجد عنوان ورقة العمل هذه في الخلية الموجودة على اليسار.","متعقب مشروع إدارة الحدث"]
["توجد رسالة السرية في الخلية الموجودة على اليسار.",{"$f":"B1&\" سري\"","v":"اسم الشركة سري"}]
["يوجد تلميح في الخلية الموجودة على اليسار.","يتم حساب الخلايا المظللة لك. لا تحتاج إلى إدخال أي شيء فيها."]
["أدخل التفاصيل في جدول معلمات يبدأ من الخلية على اليسار. توجد الإرشادات التالية في الخلية A12.","نوع المشروع","مدير الحساب","مدير المشروع","مدير الاستراتيجية","أخصائي التصميم","فريق عمل الحدث","فريق عمل الإدارة","الإجمالي"]
[null,"تطوير استراتيجية الحدث",{"v":0.2,"d":"20%"},{"v":0.1,"d":"10%"},{"v":0.6,"d":"60%"},{"v":0,"d":"0%"},{"v":0,"d":"0%"},{"v":0.1,"d":"10%"},{"$f":"SUM(معلمات[[#This Row],[مدير الحساب]:[فريق عمل الإدارة]])","v":{"v":1,"d":"100%"}}]
[null,"تخطيط الحدث",{"v":0.2,"d":"20%"},{"v":0.5,"d":"50%"},{"v":0.1,"d":"10%"},{"v":0.1,"d":"10%"},{"v":0,"d":"0%"},{"v":0.1,"d":"10%"},{"$f":"SUM(معلمات[[#This Row],[مدير الحساب]:[فريق عمل الإدارة]])","v":{"v":0.9999999999999999,"d":"100%"}}]
[null,"تصميم الحدث",{"v":0.2,"d":"20%"},{"v":0.2,"d":"20%"},{"v":0,"d":"0%"},{"v":0.5,"d":"50%"},{"v":0,"d":"0%"},{"v":0.1,"d":"10%"},{"$f":"SUM(معلمات[[#This Row],[مدير الحساب]:[فريق عمل الإدارة]])","v":{"v":1,"d":"100%"}}]
{"$rows_left_out":17}
{"sheet":"تفاصيل المشروع","index":2,"n_rows":10,"n_cols":23,"rows_kept":10}
["أنشئ تفاصيل المشروع في ورقة العمل هذه. يتم تحديث اسم الشركة تلقائياً في الخلية على اليسار. وتوجد إرشادات مفيدة في الخلايا الموجودة في هذا العمود. السهم لأسفل لبدء الاستخدام.",{"$f":"'معلمات المشروع'!B1","v":"اسم الشركة"}]
["يوجد عنوان ورقة العمل هذه في الخلية الموجودة على اليسار.","متعقب مشروع إدارة الحدث"]
["توجد رسالة السرية في الخلية الموجودة على اليسار.",{"$f":"'معلمات المشروع'!B3","v":"اسم الشركة سري"}]
["أدخل المعلومات في جدول تفاصيل المشروع الذي يبدأ من الخلية على اليسار.\nمعلومات\nلإضافة صف في الجدول على اليسار، حدّد الخلية الموجودة في أقصى الجزء السفلي الأيسر في هيكل الجدول (وليس صف الإجماليات) واضغط على علامة التبويب، أو اضغط على مفتاح SHIFT+F10 في المكان الذي تريد إدراج الصف فيه وحدّد إدراج | صفوف الجدول لأعلى/أدناه.\nتأكد من حذف جميع الصفوف غير المستخدمة، حيث سيستخدم إجماليات المشروع PivotTable جميع خلايا الجداول، وإلا سيُعطي نتائج خاطئة.","اسم المشروع","نوع المشروع","البدء المُقدّر","الإنهاء المُقدّر","البدء الفعلي","الإنهاء الفعلي","العمل المُقدر","العمل الفعلي","المدة المُقدرة","المدة الفعلية","مدير الحساب","مدير المشروع","مدير الاستراتيجية","أخصائي التصميم","فريق عمل الحدث","فريق عمل الإدارة","مدير الحساب ","مدير المشروع ","مدير الاستراتيجية ","أخصائي التصميم ","فريق عمل الحدث ","فريق عمل الإدارة "]
[null,"المشروع 1","تطوير استراتيجية الحدث",{"$f":"DATE(YEAR(TODAY()),6,9)","v":"2019-06-09"},{"$f":"DATE(YEAR(TODAY()),8,7)","v":"2019-08-07"},{"$f":"DATE(YEAR(TODAY()),6,29)","v":"2019-06-29"},{"$f":"DATE(YEAR(TODAY()),9,3)","v":"2019-09-03"},200,220,{"$f":"DAYS360(تفاصيل_المشروع[[#This Row],[البدء المُقدّر]],تفاصيل_المشروع[[#This Row],[الإنهاء المُقدّر]],FALSE)","v":58},{"$f":"DAYS360(تفاصيل_المشروع[[#This Row],[البدء الفعلي]],تفاصيل_المشروع[[#This Row],[الإنهاء الفعلي]],FALSE)","v":64},{"$f":"INDEX(معلمات[],MATCH(تفاصيل_المشروع[[#This Row],[نوع المشروع]],معلمات[نوع المشروع],0),MATCH(تفاصيل_المشروع[[#Headers],[مدير الحساب]],معلمات[#Headers],0))*INDEX('معلمات المشروع'!$B$12:$H$12,1,MATCH(تفاصيل_المشروع[[#Headers],[مدير الحساب]],معلمات[#Headers],0))*تفاصيل_المشروع[[#This Row],[العمل المُقدر]]","v":{"v":7200,"d":"ر.س.‏ 7,200"}},{"$f":"INDEX(معلمات[],MATCH(تفاصيل_المشروع[[#This Row],[نوع المشروع]],معلمات[نوع المشروع],0),MATCH(تفاصيل_المشروع[[#Headers],[مدير المشروع]],معلمات[#Headers],0))*INDEX('معلمات المشروع'!$B$12:$H$12,1,MATCH(تفاصيل_المشروع[[#Headers],[مدير المشروع]],معلمات[#Headers],0))*تفاصيل_المشروع[[#This Row],[العمل المُقدر]]","v":{"v":2400,"d":"ر.س.‏ 2,400"}},{"$f":"INDEX(معلمات[],MATCH(تفاصيل_المشروع[[#This Row],[نوع المشروع]],معلمات[نوع المشروع],0),MATCH(تفاصيل_المشروع[[#Headers],[مدير الاستراتيجية]],معلمات[#Headers],0))*INDEX('معلمات المشروع'!$B$12:$H$12,1,MATCH(تفاصيل_المشروع[[#Headers],[مدير الاستراتيجية]],معلمات[#Headers],0))*تفاصيل_المشروع[[#This Row],[العمل المُقدر]]","v":{"v":18000,"d":"ر.س.‏ 18,000"}},{"$f":"INDEX(معلمات[],MATCH(تفاصيل_المشروع[[#This Row],[نوع المشروع]],معلمات[نوع المشروع],0),MATCH(تفاصيل_المشروع[[#Headers],[أخصائي التصميم]],معلمات[#Headers],0))*INDEX('معلمات المشروع'!$B$12:$H$12,1,MATCH(تفاصيل_المشروع[[#Headers],[أخصائي التصميم]],معلمات[#Headers],0))*تفاصيل_المشروع[[#This Row],[العمل المُقدر]]","v":{"v":0,"d":"ر.س.‏ 0"}},{"$f":"INDEX(معلمات[],MATCH(تفاصيل_المشروع[[#This Row],[نوع المشروع]],معلمات[نوع المشروع],0),MATCH(تفاصيل_المشروع[[#Headers],[فريق عمل الحدث]],معلمات[#Headers],0))*INDEX('معلمات المشروع'!$B$12:$H$12,1,MATCH(تفاصيل_المشروع[[#Headers],[فريق عمل الحدث]],معلمات[#Headers],0))*تفاصيل_المشروع[[#This Row],[العمل المُقدر]]","v":{"v":0,"d":"ر.س.‏ 0"}},{"$f":"INDEX(معلمات[],MATCH(تفاصيل_المشروع[[#This Row],[نوع المشروع]],معلمات[نوع المشروع],0),MATCH(تفاصيل_المشروع[[#Headers],[فريق عمل الإدارة]],معلمات[#Headers],0))*INDEX('معلمات المشروع'!$B$12:$H$12,1,MATCH(تفاصيل_المشروع[[#Headers],[فريق عمل الإدارة]],معلمات[#Headers],0))*تفاصيل_المشروع[[#This Row],[العمل المُقدر]]","v":{"v":1200,"d":"ر.س.‏ 1,200"}},{"$f":"INDEX(معلمات[],MATCH(تفاصيل_المشروع[[#This Row],[نوع المشروع]],معلمات[نوع المشروع],0),MATCH(تفاصيل_المشروع[[#Headers],[مدير الحساب]],معلمات[#Headers],0))*INDEX('معلمات المشروع'!$B$12:$H$12,1,MATCH(تفاصيل_المشروع[[#Headers],[مدير الحساب]],معلمات[#Headers],0))*تفاصيل_المشروع[[#This Row],[العمل الفعلي]]","v":{"v":7920,"d":"ر.س.‏ 7,920"}},{"$f":"INDEX(معلمات[],MATCH(تفاصيل_المشروع[[#This Row],[نوع المشروع]],معلمات[نوع المشروع],0),MATCH(تفاصيل_المشروع[[#Headers],[مدير المشروع]],معلمات[#Headers],0))*INDEX('معلمات المشروع'!$B$12:$H$12,1,MATCH(تفاصيل_المشروع[[#Headers],[مدير المشروع]],معلمات[#Headers],0))*تفاصيل_المشروع[[#This Row],[العمل الفعلي]]","v":{"v":2640,"d":"ر.س.‏ 2,640"}},{"$f":"INDEX(معلمات[],MATCH(تفاصيل_المشروع[[#This Row],[نوع المشروع]],معلمات[نوع المشروع],0),MATCH(تفاصيل_المشروع[[#Headers],[مدير الاستراتيجية]],معلمات[#Headers],0))*INDEX('معلمات المشروع'!$B$12:$H$12,1,MATCH(تفاصيل_المشروع[[#Headers],[مدير الاستراتيجية]],معلمات[#Headers],0))*تفاصيل_المشروع[[#This Row],[العمل الفعلي]]","v":{"v":19800,"d":"ر.س.‏ 19,800"}},{"$f":"INDEX(معلمات[],MATCH(تفاصيل_المشروع[[#This Row],[نوع المشروع]],معلمات[نوع المشروع],0),MATCH(تفاصيل_المشروع[[#Headers],[أخصائي التصميم]],معلمات[#Headers],0))*INDEX('معلمات المشروع'!$B$12:$H$12,1,MATCH(تفاصيل_المشروع[[#Headers],[أخصائي التصميم]],معلمات[#Headers],0))*تفاصيل_المشروع[[#This Row],[العمل الفعلي]]","v":{"v":0,"d":"ر.س.‏ 0"}},{"$f":"INDEX(معلمات[],MATCH(تفاصيل_المشروع[[#This Row],[نوع المشروع]],معلمات[نوع المشروع],0),MATCH(تفاصيل_المشروع[[#Headers],[فريق عمل الحدث]],معلمات[#Headers],0))*INDEX('معلمات المشروع'!$B$12:$H$12,1,MATCH(تفاصيل_المشروع[[#Headers],[فريق عمل الحدث]],معلمات[#Headers],0))*تفاصيل_المشروع[[#This Row],[العمل الفعلي]]","v":{"v":0,"d":"ر.س.‏ 0"}},{"$f":"INDEX(معلمات[],MATCH(تفاصيل_المشروع[[#This Row],[نوع المشروع]],معلمات[نوع المشروع],0),MATCH(تفاصيل_المشروع[[#Headers],[فريق عمل الإدارة]],معلمات[#Headers],0))*INDEX('معلمات المشروع'!$B$12:$H$12,1,MATCH(تفاصيل_المشروع[[#Headers],[فريق عمل الإدارة]],معلمات[#Headers],0))*تفاصيل_المشروع[[#This Row],[العمل الفعلي]]","v":{"v":1320,"d":"ر.س.‏ 1,320"}}]
[null,"المشروع 2","تخطيط الحدث",{"$f":"DATE(YEAR(TODAY())+1,6,25)","v":"2020-06-25"},{"$f":"DATE(YEAR(TODAY())+1,7,27)","v":"2020-07-27"},{"$f":"DATE(YEAR(TODAY()),7,15)","v":"2019-07-15"},{"$f":"DATE(YEAR(TODAY())+1,8,25)","v":"2020-08-25"},400,390,{"$f":"DAYS360(تفاصيل_المشروع[[#This Row],[البدء المُقدّر]],تفاصيل_المشروع[[#This Row],[الإنهاء المُقدّر]],FALSE)","v":32},{"$f":"DAYS360(تفاصيل_المشروع[[#This Row],[البدء الفعلي]],تفاصيل_المشروع[[#This Row],[الإنهاء الفعلي]],FALSE)","v":400},{"$f":"INDEX(معلمات[],MATCH(تفاصيل_المشروع[[#This Row],[نوع المشروع]],معلمات[نوع المشروع],0),MATCH(تفاصيل_المشروع[[#Headers],[مدير الحساب]],معلمات[#Headers],0))*INDEX('معلمات المشروع'!$B$12:$H$12,1,MATCH(تفاصيل_المشروع[[#Headers],[مدير الحساب]],معلمات[#Headers],0))*تفاصيل_المشروع[[#This Row],[العمل المُقدر]]","v":{"v":14400,"d":"ر.س.‏ 14,400"}},{"$f":"INDEX(معلمات[],MATCH(تفاصيل_المشروع[[#This Row],[نوع المشروع]],معلمات[نوع المشروع],0),MATCH(تفاصيل_المشروع[[#Headers],[مدير المشروع]],معلمات[#Headers],0))*INDEX('معلمات المشروع'!$B$12:$H$12,1,MATCH(تفاصيل_المشروع[[#Headers],[مدير المشروع]],معلمات[#Headers],0))*تفاصيل_المشروع[[#This Row],[العمل المُقدر]]","v":{"v":24000,"d":"ر.س.‏ 24,000"}},{"$f":"INDEX(معلمات[],MATCH(تفاصيل_المشروع[[#This Row],[نوع المشروع]],معلمات[نوع المشروع],0),MATCH(تفاصيل_المشروع[[#Headers],[مدير الاستراتيجية]],معلمات[#Headers],0))*INDEX('معلمات المشروع'!$B$12:$H$12,1,MATCH(تفاصيل_المشروع[[#Headers],[مدير الاستراتيجية]],معلمات[#Headers],0))*تفاصيل_المشروع[[#This Row],[العمل المُقدر]]","v":{"v":6000,"d":"ر.س.‏ 6,000"}},{"$f":"INDEX(معلمات[],MATCH(تفاصيل_المشروع[[#This Row],[نوع المشروع]],معلمات[نوع المشروع],0),MATCH(تفاصيل_المشروع[[#Headers],[أخصائي التصميم]],معلمات[#Headers],0))*INDEX('معلمات المشروع'!$B$12:$H$12,1,MATCH(تفاصيل_المشروع[[#Headers],[أخصائي التصميم]],معلمات[#Headers],0))*تفاصيل_المشروع[[#This Row],[العمل المُقدر]]","v":{"v":4000,"d":"ر.س.‏ 4,000"}},{"$f":"INDEX(معلمات[],MATCH(تفاصيل_المشروع[[#This Row],[نوع المشروع]],معلمات[نوع المشروع],0),MATCH(تفاصيل_المشروع[[#Headers],[فريق عمل الحدث]],معلمات[#Headers],0))*INDEX('معلمات المشروع'!$B$12:$H$12,1,MATCH(تفاصيل_المشروع[[#Headers],[فريق عمل الحدث]],معلمات[#Headers],0))*تفاصيل_المشروع[[#This Row],[العمل المُقدر]]","v":{"v":0,"d":"ر.س.‏ 0"}},{"$f":"INDEX(معلمات[],MATCH(تفاصيل_المشروع[[#This Row],[نوع المشروع]],معلمات[نوع المشروع],0),MATCH(تفاصيل_المشروع[[#Headers],[فريق عمل الإدارة]],معلمات[#Headers],0))*INDEX('معلمات المشروع'!$B$12:$H$12,1,MATCH(تفاصيل_المشروع[[#Headers],[فريق عمل الإدارة]],معلمات[#Headers],0))*تفاصيل_المشروع[[#This Row],[العمل المُقدر]]","v":{"v":2400,"d":"ر.س.‏ 2,400"}},{"$f":"INDEX(معلمات[],MATCH(تفاصيل_المشروع[[#This Row],[نوع المشروع]],معلمات[نوع المشروع],0),MATCH(تفاصيل_المشروع[[#Headers],[مدير الحساب]],معلمات[#Headers],0))*INDEX('معلمات المشروع'!$B$12:$H$12,1,MATCH(تفاصيل_المشروع[[#Headers],[مدير الحساب]],معلمات[#Headers],0))*تفاصيل_المشروع[[#This Row],[العمل الفعلي]]","v":{"v":14040,"d":"ر.س.‏ 14,040"}},{"$f":"INDEX(معلمات[],MATCH(تفاصيل_المشروع[[#This Row],[نوع المشروع]],معلمات[نوع المشروع],0),MATCH(تفاصيل_المشروع[[#Headers],[مدير المشروع]],معلمات[#Headers],0))*INDEX('معلمات المشروع'!$B$12:$H$12,1,MATCH(تفاصيل_المشروع[[#Headers],[مدير المشروع]],معلمات[#Headers],0))*تفاصيل_المشروع[[#This Row],[العمل الفعلي]]","v":{"v":23400,"d":"ر.س.‏ 23,400"}},{"$f":"INDEX(معلمات[],MATCH(تفاصيل_المشروع[[#This Row],[نوع المشروع]],معلمات[نوع المشروع],0),MATCH(تفاصيل_المشروع[[#Headers],[مدير الاستراتيجية]],معلمات[#Headers],0))*INDEX('معلمات المشروع'!$B$12:$H$12,1,MATCH(تفاصيل_المشروع[[#Headers],[مدير الاستراتيجية]],معلمات[#Headers],0))*تفاصيل_المشروع[[#This Row],[العمل الفعلي]]","v":{"v":5850,"d":"ر.س.‏ 5,850"}},{"$f":"INDEX(معلمات[],MATCH(تفاصيل_المشروع[[#This Row],[نوع المشروع]],معلمات[نوع المشروع],0),MATCH(تفاصيل_المشروع[[#Headers],[أخصائي التصميم]],معلمات[#Headers],0))*INDEX('معلمات المشروع'!$B$12:$H$12,1,MATCH(تفاصيل_المشروع[[#Headers],[أخصائي التصميم]],معلمات[#Headers],0))*تفاصيل_المشروع[[#This Row],[العمل الفعلي]]","v":{"v":3900,"d":"ر.س.‏ 3,900"}},{"$f":"INDEX(معلمات[],MATCH(تفاصيل_المشروع[[#This Row],[نوع المشروع]],معلمات[نوع المشروع],0),MATCH(تفاصيل_المشروع[[#Headers],[فريق عمل الحدث]],معلمات[#Headers],0))*INDEX('معلمات المشروع'!$B$12:$H$12,1,MATCH(تفاصيل_المشروع[[#Headers],[فريق عمل الحدث]],معلمات[#Headers],0))*تفاصيل_المشروع[[#This Row],[العمل الفعلي]]","v":{"v":0,"d":"ر.س.‏ 0"}},{"$f":"INDEX(معلمات[],MATCH(تفاصيل_المشروع[[#This Row],[نوع المشروع]],معلمات[نوع المشروع],0),MATCH(تفاصيل_المشروع[[#Headers],[فريق عمل الإدارة]],معلمات[#Headers],0))*INDEX('معلمات المشروع'!$B$12:$H$12,1,MATCH(تفاصيل_المشروع[[#Headers],[فريق عمل الإدارة]],معلمات[#Headers],0))*تفاصيل_المشروع[[#This Row],[العمل الفعلي]]","v":{"v":2340,"d":"ر.س.‏ 2,340"}}]
[null,"المشروع 3","تصميم الحدث",{"$f":"DATE(YEAR(TODAY())+2,7,12)","v":"2021-07-12"},{"$f":"DATE(YEAR(TODAY())+2,9,19)","v":"2021-09-19"},{"$f":"DATE(YEAR(TODAY())+6,8,7)","v":"2025-08-07"},{"$f":"DATE(YEAR(TODAY())+6,10,10)","v":"2025-10-10"},500,500,{"$f":"DAYS360(تفاصيل_المشروع[[#This Row],[البدء المُقدّر]],تفاصيل_المشروع[[#This Row],[الإنهاء المُقدّر]],FALSE)","v":67},{"$f":"DAYS360(تفاصيل_المشروع[[#This Row],[البدء الفعلي]],تفاصيل_المشروع[[#This Row],[الإنهاء الفعلي]],FALSE)","v":63},{"$f":"INDEX(معلمات[],MATCH(تفاصيل_المشروع[[#This Row],[نوع المشروع]],معلمات[نوع المشروع],0),MATCH(تفاصيل_المشروع[[#Headers],[مدير الحساب]],معلمات[#Headers],0))*INDEX('معلمات المشروع'!$B$12:$H$12,1,MATCH(تفاصيل_المشروع[[#Headers],[مدير الحساب]],معلمات[#Headers],0))*تفاصيل_المشروع[[#This Row],[العمل المُقدر]]","v":{"v":18000,"d":"ر.س.‏ 18,000"}},{"$f":"INDEX(معلمات[],MATCH(تفاصيل_المشروع[[#This Row],[نوع المشروع]],معلمات[نوع المشروع],0),MATCH(تفاصيل_المشروع[[#Headers],[مدير المشروع]],معلمات[#Headers],0))*INDEX('معلمات المشروع'!$B$12:$H$12,1,MATCH(تفاصيل_المشروع[[#Headers],[مدير المشروع]],معلمات[#Headers],0))*تفاصيل_المشروع[[#This Row],[العمل المُقدر]]","v":{"v":12000,"d":"ر.س.‏ 12,000"}},{"$f":"INDEX(معلمات[],MATCH(تفاصيل_المشروع[[#This Row],[نوع المشروع]],معلمات[نوع المشروع],0),MATCH(تفاصيل_المشروع[[#Headers],[مدير الاستراتيجية]],معلمات[#Headers],0))*INDEX('معلمات المشروع'!$B$12:$H$12,1,MATCH(تفاصيل_المشروع[[#Headers],[مدير الاستراتيجية]],معلمات[#Headers],0))*تفاصيل_المشروع[[#This Row],[العمل المُقدر]]","v":{"v":0,"d":"ر.س.‏ 0"}},{"$f":"INDEX(معلمات[],MATCH(تفاصيل_المشروع[[#This Row],[نوع المشروع]],معلمات[نوع المشروع],0),MATCH(تفاصيل_المشروع[[#Headers],[أخصائي التصميم]],معلمات[#Headers],0))*INDEX('معلمات المشروع'!$B$12:$H$12,1,MATCH(تفاصيل_المشروع[[#Headers],[أخصائي التصميم]],معلمات[#Headers],0))*تفاصيل_المشروع[[#This Row],[العمل المُقدر]]","v":{"v":25000,"d":"ر.س.‏ 25,000"}},{"$f":"INDEX(معلمات[],MATCH(تفاصيل_المشروع[[#This Row],[نوع المشروع]],معلمات[نوع المشروع],0),MATCH(تفاصيل_المشروع[[#Headers],[فريق عمل الحدث]],معلمات[#Headers],0))*INDEX('معلمات المشروع'!$B$12:$H$12,1,MATCH(تفاصيل_المشروع[[#Headers],[فريق عمل الحدث]],معلمات[#Headers],0))*تفاصيل_المشروع[[#This Row],[العمل المُقدر]]","v":{"v":0,"d":"ر.س.‏ 0"}},{"$f":"INDEX(معلمات[],MATCH(تفاصيل_المشروع[[#This Row],[نوع المشروع]],معلمات[نوع المشروع],0),MATCH(تفاصيل_المشروع[[#Headers],[فريق عمل الإدارة]],معلمات[#Headers],0))*INDEX('معلمات المشروع'!$B$12:$H$12,1,MATCH(تفاصيل_المشروع[[#Headers],[فريق عمل الإدارة]],معلمات[#Headers],0))*تفاصيل_المشروع[[#This Row],[العمل المُقدر]]","v":{"v":3000,"d":"ر.س.‏ 3,000"}},{"$f":"INDEX(معلمات[],MATCH(تفاصيل_المشروع[[#This Row],[نوع المشروع]],معلمات[نوع المشروع],0),MATCH(تفاصيل_المشروع[[#Headers],[مدير الحساب]],معلمات[#Headers],0))*INDEX('معلمات المشروع'!$B$12:$H$12,1,MATCH(تفاصيل_المشروع[[#Headers],[مدير الحساب]],معلمات[#Headers],0))*تفاصيل_المشروع[[#This Row],[العمل الفعلي]]","v":{"v":18000,"d":"ر.س.‏ 18,000"}},{"$f":"INDEX(معلمات[],MATCH(تفاصيل_المشروع[[#This Row],[نوع المشروع]],معلمات[نوع المشروع],0),MATCH(تفاصيل_المشروع[[#Headers],[مدير المشروع]],معلمات[#Headers],0))*INDEX('معلمات المشروع'!$B$12:$H$12,1,MATCH(تفاصيل_المشروع[[#Headers],[مدير المشروع]],معلمات[#Headers],0))*تفاصيل_المشروع[[#This Row],[العمل الفعلي]]","v":{"v":12000,"d":"ر.س.‏ 12,000"}},{"$f":"INDEX(معلمات[],MATCH(تفاصيل_المشروع[[#This Row],[نوع المشروع]],معلمات[نوع المشروع],0),MATCH(تفاصيل_المشروع[[#Headers],[مدير الاستراتيجية]],معلمات[#Headers],0))*INDEX('معلمات المشروع'!$B$12:$H$12,1,MATCH(تفاصيل_المشروع[[#Headers],[مدير الاستراتيجية]],معلمات[#Headers],0))*تفاصيل_المشروع[[#This Row],[العمل الفعلي]]","v":{"v":0,"d":"ر.س.‏ 0"}},{"$f":"INDEX(معلمات[],MATCH(تفاصيل_المشروع[[#This Row],[نوع المشروع]],معلمات[نوع المشروع],0),MATCH(تفاصيل_المشروع[[#Headers],[أخصائي التصميم]],معلمات[#Headers],0))*INDEX('معلمات المشروع'!$B$12:$H$12,1,MATCH(تفاصيل_المشروع[[#Headers],[أخصائي التصميم]],معلمات[#Headers],0))*تفاصيل_المشروع[[#This Row],[العمل الفعلي]]","v":{"v":25000,"d":"ر.س.‏ 25,000"}},{"$f":"INDEX(معلمات[],MATCH(تفاصيل_المشروع[[#This Row],[نوع المشروع]],معلمات[نوع المشروع],0),MATCH(تفاصيل_المشروع[[#Headers],[فريق عمل الحدث]],معلمات[#Headers],0))*INDEX('معلمات المشروع'!$B$12:$H$12,1,MATCH(تفاصيل_المشروع[[#Headers],[فريق عمل الحدث]],معلمات[#Headers],0))*تفاصيل_المشروع[[#This Row],[العمل الفعلي]]","v":{"v":0,"d":"ر.س.‏ 0"}},{"$f":"INDEX(معلمات[],MATCH(تفاصيل_المشروع[[#This Row],[نوع المشروع]],معلمات[نوع المشروع],0),MATCH(تفاصيل_المشروع[[#Headers],[فريق عمل الإدارة]],معلمات[#Headers],0))*INDEX('معلمات المشروع'!$B$12:$H$12,1,MATCH(تفاصيل_المشروع[[#Headers],[فريق عمل الإدارة]],معلمات[#Headers],0))*تفاصيل_المشروع[[#This Row],[العمل الفعلي]]","v":{"v":3000,"d":"ر.س.‏ 3,000"}}]
[null,"المشروع 4","لوجستيات الحدث",{"$f":"DATE(YEAR(TODAY())+3,7,30)","v":"2022-07-30"},{"$f":"DATE(YEAR(TODAY())+3,9,28)","v":"2022-09-28"},{"$f":"DATE(YEAR(TODAY())+3,9,14)","v":"2022-09-14"},{"$f":"DATE(YEAR(TODAY())+3,11,13)","v":"2022-11-13"},150,145,{"$f":"DAYS360(تفاصيل_المشروع[[#This Row],[البدء المُقدّر]],تفاصيل_المشروع[[#This Row],[الإنهاء المُقدّر]],FALSE)","v":58},{"$f":"DAYS360(تفاصيل_المشروع[[#This Row],[البدء الفعلي]],تفاصيل_المشروع[[#This Row],[الإنهاء الفعلي]],FALSE)","v":59},{"$f":"INDEX(معلمات[],MATCH(تفاصيل_المشروع[[#This Row],[نوع المشروع]],معلمات[نوع المشروع],0),MATCH(تفاصيل_المشروع[[#Headers],[مدير الحساب]],معلمات[#Headers],0))*INDEX('معلمات المشروع'!$B$12:$H$12,1,MATCH(تفاصيل_المشروع[[#Headers],[مدير الحساب]],معلمات[#Headers],0))*تفاصيل_المشروع[[#This Row],[العمل المُقدر]]","v":{"v":5400,"d":"ر.س.‏ 5,400"}},{"$f":"INDEX(معلمات[],MATCH(تفاصيل_المشروع[[#This Row],[نوع المشروع]],معلمات[نوع المشروع],0),MATCH(تفاصيل_المشروع[[#Headers],[مدير المشروع]],معلمات[#Headers],0))*INDEX('معلمات المشروع'!$B$12:$H$12,1,MATCH(تفاصيل_المشروع[[#Headers],[مدير المشروع]],معلمات[#Headers],0))*تفاصيل_المشروع[[#This Row],[العمل المُقدر]]","v":{"v":10800,"d":"ر.س.‏ 10,800"}},{"$f":"INDEX(معلمات[],MATCH(تفاصيل_المشروع[[#This Row],[نوع المشروع]],معلمات[نوع المشروع],0),MATCH(تفاصيل_المشروع[[#Headers],[مدير الاستراتيجية]],معلمات[#Headers],0))*INDEX('معلمات المشروع'!$B$12:$H$12,1,MATCH(تفاصيل_المشروع[[#Headers],[مدير الاستراتيجية]],معلمات[#Headers],0))*تفاصيل_المشروع[[#This Row],[العمل المُقدر]]","v":{"v":0,"d":"ر.س.‏ 0"}},{"$f":"INDEX(معلمات[],MATCH(تفاصيل_المشروع[[#This Row],[نوع المشروع]],معلمات[نوع المشروع],0),MATCH(تفاصيل_المشروع[[#Headers],[أخصائي التصميم]],معلمات[#Headers],0))*INDEX('معلمات المشروع'!$B$12:$H$12,1,MATCH(تفاصيل_المشروع[[#Headers],[أخصائي التصميم]],معلمات[#Headers],0))*تفاصيل_المشروع[[#This Row],[العمل المُقدر]]","v":{"v":0,"d":"ر.س.‏ 0"}},{"$f":"INDEX(معلمات[],MATCH(تفاصيل_المشروع[[#This Row],[نوع المشروع]],معلمات[نوع المشروع],0),MATCH(تفاصيل_المشروع[[#Headers],[فريق عمل الحدث]],معلمات[#Headers],0))*INDEX('معلمات المشروع'!$B$12:$H$12,1,MATCH(تفاصيل_المشروع[[#Headers],[فريق عمل الحدث]],معلمات[#Headers],0))*تفاصيل_المشروع[[#This Row],[العمل المُقدر]]","v":{"v":1200,"d":"ر.س.‏ 1,200"}},{"$f":"INDEX(معلمات[],MATCH(تفاصيل_المشروع[[#This Row],[نوع المشروع]],معلمات[نوع المشروع],0),MATCH(تفاصيل_المشروع[[#Headers],[فريق عمل الإدارة]],معلمات[#Headers],0))*INDEX('معلمات المشروع'!$B$12:$H$12,1,MATCH(تفاصيل_المشروع[[#Headers],[فريق عمل الإدارة]],معلمات[#Headers],0))*تفاصيل_المشروع[[#This Row],[العمل المُقدر]]","v":{"v":900,"d":"ر.س.‏ 900"}},{"$f":"INDEX(معلمات[],MATCH(تفاصيل_المشروع[[#This Row],[نوع المشروع]],معلمات[نوع المشروع],0),MATCH(تفاصيل_المشروع[[#Headers],[مدير الحساب]],معلمات[#Headers],0))*INDEX('معلمات المشروع'!$B$12:$H$12,1,MATCH(تفاصيل_المشروع[[#Headers],[مدير الحساب]],معلمات[#Headers],0))*تفاصيل_المشروع[[#This Row],[العمل الفعلي]]","v":{"v":5220,"d":"ر.س.‏ 5,220"}},{"$f":"INDEX(معلمات[],MATCH(تفاصيل_المشروع[[#This Row],[نوع المشروع]],معلمات[نوع المشروع],0),MATCH(تفاصيل_المشروع[[#Headers],[مدير المشروع]],معلمات[#Headers],0))*INDEX('معلمات المشروع'!$B$12:$H$12,1,MATCH(تفاصيل_المشروع[[#Headers],[مدير المشروع]],معلمات[#Headers],0))*تفاصيل_المشروع[[#This Row],[العمل الفعلي]]","v":{"v":10440,"d":"ر.س.‏ 10,440"}},{"$f":"INDEX(معلمات[],MATCH(تفاصيل_المشروع[[#This Row],[نوع المشروع]],معلمات[نوع المشروع],0),MATCH(تفاصيل_المشروع[[#Headers],[مدير الاستراتيجية]],معلمات[#Headers],0))*INDEX('معلمات المشروع'!$B$12:$H$12,1,MATCH(تفاصيل_المشروع[[#Headers],[مدير الاستراتيجية]],معلمات[#Headers],0))*تفاصيل_المشروع[[#This Row],[العمل الفعلي]]","v":{"v":0,"d":"ر.س.‏ 0"}},{"$f":"INDEX(معلمات[],MATCH(تفاصيل_المشروع[[#This Row],[نوع المشروع]],معلمات[نوع المشروع],0),MATCH(تفاصيل_المشروع[[#Headers],[أخصائي التصميم]],معلمات[#Headers],0))*INDEX('معلمات المشروع'!$B$12:$H$12,1,MATCH(تفاصيل_المشروع[[#Headers],[أخصائي التصميم]],معلمات[#Headers],0))*تفاصيل_المشروع[[#This Row],[العمل الفعلي]]","v":{"v":0,"d":"ر.س.‏ 0"}},{"$f":"INDEX(معلمات[],MATCH(تفاصيل_المشروع[[#This Row],[نوع المشروع]],معلمات[نوع المشروع],0),MATCH(تفاصيل_المشروع[[#Headers],[فريق عمل الحدث]],معلمات[#Headers],0))*INDEX('معلمات المشروع'!$B$12:$H$12,1,MATCH(تفاصيل_المشروع[[#Headers],[فريق عمل الحدث]],معلمات[#Headers],0))*تفاصيل_المشروع[[#This Row],[العمل الفعلي]]","v":{"v":1160,"d":"ر.س.‏ 1,160"}},{"$f":"INDEX(معلمات[],MATCH(تفاصيل_المشروع[[#This Row],[نوع المشروع]],معلمات[نوع المشروع],0),MATCH(تفاصيل_المشروع[[#Headers],[فريق عمل الإدارة]],معلمات[#Headers],0))*INDEX('معلمات المشروع'!$B$12:$H$12,1,MATCH(تفاصيل_المشروع[[#Headers],[فريق عمل الإدارة]],معلمات[#Headers],0))*تفاصيل_المشروع[[#This Row],[العمل الفعلي]]","v":{"v":870,"d":"ر.س.‏ 870"}}]
{"$rows_left_out":3}
{"sheet":"إجماليات المشروع","index":3,"n_rows":10,"n_cols":14,"rows_kept":10}
["احصل على إجماليات المشروع في ورقة العمل هذه. يتم تحديث اسم الشركة تلقائياً في الخلية على اليسار. وتوجد إرشادات مفيدة في الخلايا الموجودة في هذا العمود. السهم لأسفل لبدء الاستخدام.",{"$f":"'معلمات المشروع'!B1","v":"اسم الشركة"}]
["يوجد عنوان ورقة العمل هذه في الخلية الموجودة على اليسار.","متعقب مشروع إدارة الحدث"]
["توجد رسالة السرية في الخلية الموجودة على اليسار.",{"$f":"'معلمات المشروع'!B3","v":"اسم الشركة سري"}]
["يتم تحديث PivotTable الذي يبدأ من الخلية على اليسار تلقائياً.\nمعلومات\nلتحديث جدول PivotTable على اليسار قم بتحديده (أي خلية في جدول PivotTable)، ومن علامة تبويب شريط أدوات PIVOTTABLE | تحليل، حدد \"تحديث\" أو اضغط على مفتاح SHIFT+F10 في أي خلية في جدول PivotTable ثم حدد \"تحديث\".","اسم المشروع","تقدير مدير الحساب","تقدير مدير المشروع","تقدير مدير الاستراتيجية","تقدير أخصائي التصميم","تقدير فريق عمل الحدث","تقدير فريق عمل الإدارة","مدير الحساب الفعلي","مدير المشروع الفعلي ","مدير الاستراتيجية الفعلي","أخصائي التصميم الفعلي","فريق عمل الحدث الفعلي","فريق عمل الإدارة الفعلي"]
[null,"المشروع 1",{"v":7200,"d":"ر.س.‏ 7,200.00"},{"v":2400,"d":"ر.س.‏ 2,400.00"},{"v":18000,"d":"ر.س.‏ 18,000.00"},{"v":0,"d":"ر.س.‏ 0.00"},{"v":0,"d":"ر.س.‏ 0.00"},{"v":1200,"d":"ر.س.‏ 1,200.00"},{"v":7920,"d":"ر.س.‏ 7,920.00"},{"v":2640,"d":"ر.س.‏ 2,640.00"},{"v":19800,"d":"ر.س.‏ 19,800.00"},{"v":0,"d":"ر.س.‏ 0.00"},{"v":0,"d":"ر.س.‏ 0.00"},{"v":1320,"d":"ر.س.‏ 1,320.00"}]
[null,"المشروع 2",{"v":14400,"d":"ر.س.‏ 14,400.00"},{"v":24000,"d":"ر.س.‏ 24,000.00"},{"v":6000,"d":"ر.س.‏ 6,000.00"},{"v":4000,"d":"ر.س.‏ 4,000.00"},{"v":0,"d":"ر.س.‏ 0.00"},{"v":2400,"d":"ر.س.‏ 2,400.00"},{"v":14040,"d":"ر.س.‏ 14,040.00"},{"v":23400,"d":"ر.س.‏ 23,400.00"},{"v":5850,"d":"ر.س.‏ 5,850.00"},{"v":3900,"d":"ر.س.‏ 3,900.00"},{"v":0,"d":"ر.س.‏ 0.00"},{"v":2340,"d":"ر.س.‏ 2,340.00"}]
[null,"المشروع 3",{"v":18000,"d":"ر.س.‏ 18,000.00"},{"v":12000,"d":"ر.س.‏ 12,000.00"},{"v":0,"d":"ر.س.‏ 0.00"},{"v":25000,"d":"ر.س.‏ 25,000.00"},{"v":0,"d":"ر.س.‏ 0.00"},{"v":3000,"d":"ر.س.‏ 3,000.00"},{"v":18000,"d":"ر.س.‏ 18,000.00"},{"v":12000,"d":"ر.س.‏ 12,000.00"},{"v":0,"d":"ر.س.‏ 0.00"},{"v":25000,"d":"ر.س.‏ 25,000.00"},{"v":0,"d":"ر.س.‏ 0.00"},{"v":3000,"d":"ر.س.‏ 3,000.00"}]
[null,"المشروع 4",{"v":5400,"d":"ر.س.‏ 5,400.00"},{"v":10800,"d":"ر.س.‏ 10,800.00"},{"v":0,"d":"ر.س.‏ 0.00"},{"v":0,"d":"ر.س.‏ 0.00"},{"v":1200,"d":"ر.س.‏ 1,200.00"},{"v":900,"d":"ر.س.‏ 900.00"},{"v":5220,"d":"ر.س.‏ 5,220.00"},{"v":10440,"d":"ر.س.‏ 10,440.00"},{"v":0,"d":"ر.س.‏ 0.00"},{"v":0,"d":"ر.س.‏ 0.00"},{"v":1160,"d":"ر.س.‏ 1,160.00"},{"v":870,"d":"ر.س.‏ 870.00"}]
{"$rows_left_out":2}