{"text_format":"3","workbook":"xlsx","n_sheets":4,"sheets":["متعقب الدرجات","الأداء","إعدادات","الحسابات"],"not_rendered":{"defined_names":3,"comments":1},"read":"whole","date_system":"1900"}

{"sheet":"متعقب الدرجات","index":0,"n_rows":14,"n_cols":6,"rows_kept":14}
[null,"أدخل درجاتك هنا"]
[]
[null,null,"الفصل الدراسي","النوع","الوصف","الدرجات"]
[null,null,"الفرنسية الحديثة","الواجب المنزلي","تاريخ الحرب العالمية الثانية",{"v":0.8,"d":"80%"}]
[null,null,"البرمجة المتقدمة بلغة Java","نصف العام",null,{"v":0.75,"d":"75%"}]
[null,null,"الأسبانية","الواجب المنزلي",null,{"v":0.5,"d":"50%"}]
[null,null,"الفيزياء النظرية","الواجب المنزلي",null,{"v":0.95,"d":"95%"}]
[null,null,"الفرنسية الحديثة","الواجب المنزلي","تاريخ الحرب العالمية الأولى",{"v":0.9,"d":"90%"}]
[null,null,"الفرنسية الحديثة","الواجب المنزلي","الصفحات من 30 حتى 41",{"v":0.8,"d":"80%"}]
[null,null,"الإنشاء","المقالة","مقالة حول الإقناع",{"v":0.95,"d":"95%"}]
[null,null,"الرياضيات 1","الواجب المنزلي","الصفحتان 21 و26",{"v":0.8,"d":"80%"}]
[null,null,"الرياضيات 2","الواجب المنزلي","الصفحتان 15 و18",{"v":0.85,"d":"85%"}]
[null,null,"الرياضيات 1","الواجب المنزلي","الصفحات من 34 حتى 36",{"v":0.8,"d":"80%"}]
[null,null,"الرياضيات 2","اختبار",null,{"v":0.95,"d":"95%"}]

{"sheet":"الأداء","index":1,"n_rows":31,"n_cols":8,"rows_kept":31}
[null,"الأداء"]
[]
[null,null,"الإجماليات"]
[null,null,{"$f":"\"الساعات: \"&SUM(tblClasses[الساعات المعتمدة])","v":"الساعات: 24"},{"$f":"AVERAGE(D7:D31)","v":{"v":0.8104761904761906,"d":"81%"}},{"$f":"AVERAGE(E7:E31)","v":{"v":2.7142857142857144,"d":"2.71"}},{"$f":"SUM(F7:F31)","v":{"v":2.625,"d":"2.63"}},{"$f":"IFERROR(HLOOKUP(D4,lstGPAMapping,2),\"\")","v":"B-"}]
[]
[null,null,"الفصول الدراسية","النسبة","متوسط الدرجات","متوسط الدرجات المرجّحة","الحرف","الأداء العام"]
[null,null,{"$f":"الحسابات!C6","v":"الفرنسية الحديثة"},{"$f":"الحسابات!AL6","v":{"v":0.8333333333333334,"d":"83%"}},{"$f":"الحسابات!AM6","v":{"v":3,"d":"3.00"}},{"$f":"IFERROR(E7*إعدادات!D9/SUM(tblClasses[الساعات المعتمدة]),\"\")","v":{"v":0.375,"d":"0.38"}},{"$f":"الحسابات!AN6","v":"B"}]
[null,null,{"$f":"الحسابات!C7","v":"الفيزياء النظرية"},{"$f":"الحسابات!AL7","v":{"v":0.95,"d":"95%"}},{"$f":"الحسابات!AM7","v":{"v":4,"d":"4.00"}},{"$f":"IFERROR(E8*إعدادات!D10/SUM(tblClasses[الساعات المعتمدة]),\"\")","v":{"v":0.5,"d":"0.50"}},{"$f":"الحسابات!AN7","v":"A"}]
[null,null,{"$f":"الحسابات!C8","v":"الرياضيات 1"},{"$f":"الحسابات!AL8","v":{"v":0.8000000000000002,"d":"80%"}},{"$f":"الحسابات!AM8","v":2.67},{"$f":"IFERROR(E9*إعدادات!D11/SUM(tblClasses[الساعات المعتمدة]),\"\")","v":{"v":0.445,"d":"0.45"}},{"$f":"الحسابات!AN8","v":"B-"}]
[null,null,{"$f":"الحسابات!C9","v":"الرياضيات 2"},{"$f":"الحسابات!AL9","v":{"v":0.89,"d":"89%"}},{"$f":"الحسابات!AM9","v":3.33},{"$f":"IFERROR(E10*إعدادات!D12/SUM(tblClasses[الساعات المعتمدة]),\"\")","v":{"v":0.555,"d":"0.56"}},{"$f":"الحسابات!AN9","v":"B+ "}]
[null,null,{"$f":"الحسابات!C10","v":"البرمجة المتقدمة بلغة Java"},{"$f":"الحسابات!AL10","v":{"v":0.7500000000000001,"d":"75%"}},{"$f":"الحسابات!AM10","v":{"v":2,"d":"2.00"}},{"$f":"IFERROR(E11*إعدادات!D13/SUM(tblClasses[الساعات المعتمدة]),\"\")","v":{"v":0.4166666666666667,"d":"0.42"}},{"$f":"الحسابات!AN10","v":"C"}]
[null,null,{"$f":"الحسابات!C11","v":"الأسبانية"},{"$f":"الحسابات!AL11","v":{"v":0.5,"d":"50%"}},{"$f":"الحسابات!AM11","v":{"v":0,"d":"0.00"}},{"$f":"IFERROR(E12*إعدادات!D14/SUM(tblClasses[الساعات المعتمدة]),\"\")","v":{"v":0,"d":"0.00"}},{"$f":"الحسابات!AN11","v":"F"}]
[null,null,{"$f":"الحسابات!C12","v":"الإنشاء"},{"$f":"الحسابات!AL12","v":{"v":0.95,"d":"95%"}},{"$f":"الحسابات!AM12","v":{"v":4,"d":"4.00"}},{"$f":"IFERROR(E13*إعدادات!D15/SUM(tblClasses[الساعات المعتمدة]),\"\")","v":{"v":0.3333333333333333,"d":"0.33"}},{"$f":"الحسابات!AN12","v":"A"}]
[null,null,{"$f":"الحسابات!C13","v":""},{"$f":"الحسابات!AL13","v":""},{"$f":"الحسابات!AM13","v":""},{"$f":"IFERROR(E14*إعدادات!D16/SUM(tblClasses[الساعات المعتمدة]),\"\")","v":""},{"$f":"الحسابات!AN13","v":""}]
[null,null,{"$f":"الحسابات!C14","v":""},{"$f":"الحسابات!AL14","v":""},{"$f":"الحسابات!AM14","v":""},{"$f":"IFERROR(E15*إعدادات!D17/SUM(tblClasses[الساعات المعتمدة]),\"\")","v":""},{"$f":"الحسابات!AN14","v":""}]
{"$rows_left_out":17}
{"sheet":"إعدادات","index":2,"n_rows":15,"n_cols":16,"rows_kept":15,"merged":[[5,2,5,15]]}
[null,"إعدادات"]
[null,null,"تعيين الدرجات ومتوسط الدرجات"]
[null,null,"النسبة",{"v":0,"d":"0%"},{"v":0.6,"d":"60%"},{"v":0.63,"d":"63%"},{"v":0.67,"d":"67%"},{"v":0.7,"d":"70%"},{"v":0.73,"d":"73%"},{"v":0.77,"d":"77%"},{"v":0.8,"d":"80%"},{"v":0.83,"d":"83%"},{"v":0.87,"d":"87%"},{"v":0.9,"d":"90%"},{"v":0.93,"d":"93%"},{"v":0.97,"d":"97%"}]
[null,null,"الدرجة ممثلة بحرف","F","D-","D","D+","C-","C","C+","B-","B","B+ ","A-","A","A+"]
[null,null,"متوسط الدرجات",0,0.67,1,1.33,1.67,2,2.33,2.67,3,3.33,3.67,4,4]
[]
[null,null,"الدرجات المرجّحة لما يصل إلى 25 فصلاً دراسياً"]
[null,null,"الفصول الدراسية التي تحضرها","الساعات المعتمدة","الواجب المنزلي","المقالة","اختبار","المشروع","نصف العام","الاختبار النهائي","غير ذلك","إجمالي النسبة"]
[null,null,"الفرنسية الحديثة",{"v":3,"d":"3.0"},{"v":0.1,"d":"10%"},{"v":0.15,"d":"15%"},{"v":0.15,"d":"15%"},{"v":0.1,"d":"10%"},{"v":0.2,"d":"20%"},{"v":0.3,"d":"30%"},null,{"$f":"SUM(tblClasses[[#This Row],[الواجب المنزلي]:[غير ذلك]])","v":{"v":1,"d":"100%"}}]
[null,null,"الفيزياء النظرية",{"v":3,"d":"3.0"},{"v":0.15,"d":"15%"},{"v":0.15,"d":"15%"},{"v":0.1,"d":"10%"},{"v":0.1,"d":"10%"},{"v":0.15,"d":"15%"},{"v":0.3,"d":"30%"},{"v":0.05,"d":"5%"},{"$f":"SUM(tblClasses[[#This Row],[الواجب المنزلي]:[غير ذلك]])","v":{"v":1,"d":"100%"}}]
[null,null,"الرياضيات 1",{"v":4,"d":"4.0"},{"v":0.1,"d":"10%"},{"v":0.15,"d":"15%"},{"v":0.15,"d":"15%"},{"v":0.1,"d":"10%"},{"v":0.2,"d":"20%"},{"v":0.3,"d":"30%"},null,{"$f":"SUM(tblClasses[[#This Row],[الواجب المنزلي]:[غير ذلك]])","v":{"v":1,"d":"100%"}}]
[null,null,"الرياضيات 2",{"v":4,"d":"4.0"},{"v":0.15,"d":"15%"},{"v":0.15,"d":"15%"},{"v":0.1,"d":"10%"},{"v":0.1,"d":"10%"},{"v":0.15,"d":"15%"},{"v":0.3,"d":"30%"},{"v":0.05,"d":"5%"},{"$f":"SUM(tblClasses[[#This Row],[الواجب المنزلي]:[غير ذلك]])","v":{"v":1,"d":"100%"}}]
[null,null,"البرمجة المتقدمة بلغة Java",{"v":5,"d":"5.0"},{"v":0.15,"d":"15%"},{"v":0.15,"d":"15%"},{"v":0.1,"d":"10%"},{"v":0.1,"d":"10%"},{"v":0.2,"d":"20%"},{"v":0.3,"d":"30%"},null,{"$f":"SUM(tblClasses[[#This Row],[الواجب المنزلي]:[غير ذلك]])","v":{"v":1,"d":"100%"}}]
[null,null,"الأسبانية",{"v":3,"d":"3.0"},{"v":0.1,"d":"10%"},{"v":0.15,"d":"15%"},{"v":0.17,"d":"17%"},{"v":0.13,"d":"13%"},{"v":0.2,"d":"20%"},{"v":0.2,"d":"20%"},{"v":0.05,"d":"5%"},{"$f":"SUM(tblClasses[[#This Row],[الواجب المنزلي]:[غير ذلك]])","v":{"v":1,"d":"100%"}}]
[null,null,"الإنشاء",{"v":2,"d":"2.0"},{"v":0.15,"d":"15%"},{"v":0.15,"d":"15%"},{"v":0.12,"d":"12%"},{"v":0.15,"d":"15%"},{"v":0.15,"d":"15%"},{"v":0.25,"d":"25%"},{"v":0.03,"d":"3%"},{"$f":"SUM(tblClasses[[#This Row],[الواجب المنزلي]:[غير ذلك]])","v":{"v":1,"d":"100%"}}]
{"$rows_left_out":1}
{"sheet":"الحسابات","index":3,"n_rows":657,"n_cols":40,"rows_kept":657,"hidden":true}
[null,"الحسابات"]
[null,null,"توفر ورقة العمل هذه حسابات الدرجات ومتوسط الدرجات ويجب أن تظل مخفية. قد يؤدي أي تغيير في هذه الورقة إلى حدوث أخطاء."]
[]
[null,null,"قائمة الفصول الدراسية الحالية","الدرجات (من 1)",{"$nulls":24},"حساب الدرجات"]
[null,null,"الفصل الدراسي",1,2,3,4,5,6,7,8,9,10,11,12,13,14,15,16,17,18,19,20,21,22,23,24,25,{"$f":"tblClasses[[#Headers],[الواجب المنزلي]]","v":"الواجب المنزلي"},{"$f":"tblClasses[[#Headers],[المقالة]]","v":"المقالة"},{"$f":"tblClasses[[#Headers],[اختبار]]","v":"اختبار"},{"$f":"tblClasses[[#Headers],[المشروع]]","v":"المشروع"},{"$f":"tblClasses[[#Headers],[نصف العام]]","v":"نصف العام"},{"$f":"tblClasses[[#Headers],[الاختبار النهائي]]","v":"الاختبار النهائي"},{"$f":"tblClasses[[#Headers],[غير ذلك]]","v":"غير ذلك"},"الإجمالي","إجمالي النقاط المحتملة","نسبة الإجمالي","الدرجة","الدرجة ممثلة بحرف"]
[null,null,{"$f":"IF(إعدادات!C9=\"\",\"\",إعدادات!C9)","v":"الفرنسية الحديثة"},{"$f":"IFERROR(INDEX(tblClassScores[],MATCH($C6:$C30&D$5:AB$5,الحسابات!$C$33:$C$657,0),4),\"\")","v":{"v":0.8,"d":"80%"}},{"v":0.9,"d":"90%"},{"v":0.8,"d":"80%"},"","","","","","","","","","","","","","","","","","","","","","",{"$f":"IFERROR(AVERAGEIFS(tblClassScores[الدرجات],tblClassScores[الفصل الدراسي],الحسابات!$C6,tblClassScores[النوع],الحسابات!AC$5)*إعدادات!E9,\"\")","v":0.08333333333333334},{"$f":"IFERROR(AVERAGEIFS(tblClassScores[الدرجات],tblClassScores[الفصل الدراسي],الحسابات!$C6,tblClassScores[النوع],الحسابات!AD$5)*إعدادات!F9,\"\")","v":""},{"$f":"IFERROR(AVERAGEIFS(tblClassScores[الدرجات],tblClassScores[الفصل الدراسي],الحسابات!$C6,tblClassScores[النوع],الحسابات!AE$5)*إعدادات!G9,\"\")","v":""},{"$f":"IFERROR(AVERAGEIFS(tblClassScores[الدرجات],tblClassScores[الفصل الدراسي],الحسابات!$C6,tblClassScores[النوع],الحسابات!AF$5)*إعدادات!H9,\"\")","v":""},{"$f":"IFERROR(AVERAGEIFS(tblClassScores[الدرجات],tblClassScores[الفصل الدراسي],الحسابات!$C6,tblClassScores[النوع],الحسابات!AG$5)*إعدادات!I9,\"\")","v":""},{"$f":"IFERROR(AVERAGEIFS(tblClassScores[الدرجات],tblClassScores[الفصل الدراسي],الحسابات!$C6,tblClassScores[النوع],الحسابات!AH$5)*إعدادات!J9,\"\")","v":""},{"$f":"IFERROR(AVERAGEIFS(tblClassScores[الدرجات],tblClassScores[الفصل الدراسي],الحسابات!$C6,tblClassScores[النوع],الحسابات!AI$5)*إعدادات!K9,\"\")","v":""},{"$f":"SUM(AC6:AI6)","v":0.08333333333333334},{"$f":"SUMIFS(إعدادات!E9:K9,الحسابات!AC6:AI6,\">0\")","v":0.1},{"$f":"IFERROR(AJ6/AK6,\"\")","v":{"v":0.8333333333333334,"d":"83%"}},{"$f":"IFERROR(HLOOKUP(AL6,lstGPAMapping,3),\"\")","v":3},{"$f":"IFERROR(HLOOKUP(AL6,lstGPAMapping,2),\"\")","v":"B"}]
[null,null,{"$f":"IF(إعدادات!C10=\"\",\"\",إعدادات!C10)","v":"الفيزياء النظرية"},{"v":0.95,"d":"95%"},"","","","","","","","","","","","","","","","","","","","","","","","",{"$f":"IFERROR(AVERAGEIFS(tblClassScores[الدرجات],tblClassScores[الفصل الدراسي],الحسابات!$C7,tblClassScores[النوع],الحسابات!AC$5)*إعدادات!E10,\"\")","v":0.1425},{"$f":"IFERROR(AVERAGEIFS(tblClassScores[الدرجات],tblClassScores[الفصل الدراسي],الحسابات!$C7,tblClassScores[النوع],الحسابات!AD$5)*إعدادات!F10,\"\")","v":""},{"$f":"IFERROR(AVERAGEIFS(tblClassScores[الدرجات],tblClassScores[الفصل الدراسي],الحسابات!$C7,tblClassScores[النوع],الحسابات!AE$5)*إعدادات!G10,\"\")","v":""},{"$f":"IFERROR(AVERAGEIFS(tblClassScores[الدرجات],tblClassScores[الفصل الدراسي],الحسابات!$C7,tblClassScores[النوع],الحسابات!AF$5)*إعدادات!H10,\"\")","v":""},{"$f":"IFERROR(AVERAGEIFS(tblClassScores[الدرجات],tblClassScores[الفصل الدراسي],الحسابات!$C7,tblClassScores[النوع],الحسابات!AG$5)*إعدادات!I10,\"\")","v":""},{"$f":"IFERROR(AVERAGEIFS(tblClassScores[الدرجات],tblClassScores[الفصل الدراسي],الحسابات!$C7,tblClassScores[النوع],الحسابات!AH$5)*إعدادات!J10,\"\")","v":""},{"$f":"IFERROR(AVERAGEIFS(tblClassScores[الدرجات],tblClassScores[الفصل الدراسي],الحسابات!$C7,tblClassScores[النوع],الحسابات!AI$5)*إعدادات!K10,\"\")","v":""},{"$f":"SUM(AC7:AI7)","v":0.1425},{"$f":"SUMIFS(إعدادات!E10:K10,الحسابات!AC7:AI7,\">0\")","v":0.15},{"$f":"IFERROR(AJ7/AK7,\"\")","v":{"v":0.95,"d":"95%"}},4,"A"]
[null,null,{"$f":"IF(إعدادات!C11=\"\",\"\",إعدادات!C11)","v":"الرياضيات 1"},{"v":0.8,"d":"80%"},{"v":0.8,"d":"80%"},"","","","","","","","","","","","","","","","","","","","","","","",{"$f":"IFERROR(AVERAGEIFS(tblClassScores[الدرجات],tblClassScores[الفصل الدراسي],الحسابات!$C8,tblClassScores[النوع],الحسابات!AC$5)*إعدادات!E11,\"\")","v":0.08000000000000002},{"$f":"IFERROR(AVERAGEIFS(tblClassScores[الدرجات],tblClassScores[الفصل الدراسي],الحسابات!$C8,tblClassScores[النوع],الحسابات!AD$5)*إعدادات!F11,\"\")","v":""},{"$f":"IFERROR(AVERAGEIFS(tblClassScores[الدرجات],tblClassScores[الفصل الدراسي],الحسابات!$C8,tblClassScores[النوع],الحسابات!AE$5)*إعدادات!G11,\"\")","v":""},{"$f":"IFERROR(AVERAGEIFS(tblClassScores[الدرجات],tblClassScores[الفصل الدراسي],الحسابات!$C8,tblClassScores[النوع],الحسابات!AF$5)*إعدادات!H11,\"\")","v":""},{"$f":"IFERROR(AVERAGEIFS(tblClassScores[الدرجات],tblClassScores[الفصل الدراسي],الحسابات!$C8,tblClassScores[النوع],الحسابات!AG$5)*إعدادات!I11,\"\")","v":""},{"$f":"IFERROR(AVERAGEIFS(tblClassScores[الدرجات],tblClassScores[الفصل الدراسي],الحسابات!$C8,tblClassScores[النوع],الحسابات!AH$5)*إعدادات!J11,\"\")","v":""},{"$f":"IFERROR(AVERAGEIFS(tblClassScores[الدرجات],tblClassScores[الفصل الدراسي],الحسابات!$C8,tblClassScores[النوع],الحسابات!AI$5)*إعدادات!K11,\"\")","v":""},0.08000000000000002,{"$f":"SUMIFS(إعدادات!E11:K11,الحسابات!AC8:AI8,\">0\")","v":0.1},{"v":0.8000000000000002,"d":"80%"},2.67,{"$f":"IFERROR(HLOOKUP(AL8,lstGPAMapping,2),\"\")","v":"B-"}]
[null,null,{"$f":"IF(إعدادات!C12=\"\",\"\",إعدادات!C12)","v":"الرياضيات 2"},{"v":0.85,"d":"85%"},{"v":0.95,"d":"95%"},"","","","","","","","","","","","","","","","","","","","","","","",{"$f":"IFERROR(AVERAGEIFS(tblClassScores[الدرجات],tblClassScores[الفصل الدراسي],الحسابات!$C9,tblClassScores[النوع],الحسابات!AC$5)*إعدادات!E12,\"\")","v":0.1275},{"$f":"IFERROR(AVERAGEIFS(tblClassScores[الدرجات],tblClassScores[الفصل الدراسي],الحسابات!$C9,tblClassScores[النوع],الحسابات!AD$5)*إعدادات!F12,\"\")","v":""},{"$f":"IFERROR(AVERAGEIFS(tblClassScores[الدرجات],tblClassScores[الفصل الدراسي],الحسابات!$C9,tblClassScores[النوع],الحسابات!AE$5)*إعدادات!G12,\"\")","v":0.095},{"$f":"IFERROR(AVERAGEIFS(tblClassScores[الدرجات],tblClassScores[الفصل الدراسي],الحسابات!$C9,tblClassScores[النوع],الحسابات!AF$5)*إعدادات!H12,\"\")","v":""},{"$f":"IFERROR(AVERAGEIFS(tblClassScores[الدرجات],tblClassScores[الفصل الدراسي],الحسابات!$C9,tblClassScores[النوع],الحسابات!AG$5)*إعدادات!I12,\"\")","v":""},{"$f":"IFERROR(AVERAGEIFS(tblClassScores[الدرجات],tblClassScores[الفصل الدراسي],الحسابات!$C9,tblClassScores[النوع],الحسابات!AH$5)*إعدادات!J12,\"\")","v":""},{"$f":"IFERROR(AVERAGEIFS(tblClassScores[الدرجات],tblClassScores[الفصل الدراسي],الحسابات!$C9,tblClassScores[النوع],الحسابات!AI$5)*إعدادات!K12,\"\")","v":""},0.2225,{"$f":"SUMIFS(إعدادات!E12:K12,الحسابات!AC9:AI9,\">0\")","v":0.25},{"v":0.89,"d":"89%"},3.33,"B+ "]
[null,null,{"$f":"IF(إعدادات!C13=\"\",\"\",إعدادات!C13)","v":"البرمجة المتقدمة بلغة Java"},{"v":0.75,"d":"75%"},"","","","","","","","","","","","","","","","","","","","","","","","",{"$f":"IFERROR(AVERAGEIFS(tblClassScores[الدرجات],tblClassScores[الفصل الدراسي],الحسابات!$C10,tblClassScores[النوع],الحسابات!AC$5)*إعدادات!E13,\"\")","v":""},{"$f":"IFERROR(AVERAGEIFS(tblClassScores[الدرجات],tblClassScores[الفصل الدراسي],الحسابات!$C10,tblClassScores[النوع],الحسابات!AD$5)*إعدادات!F13,\"\")","v":""},{"$f":"IFERROR(AVERAGEIFS(tblClassScores[الدرجات],tblClassScores[الفصل الدراسي],الحسابات!$C10,tblClassScores[النوع],الحسابات!AE$5)*إعدادات!G13,\"\")","v":""},{"$f":"IFERROR(AVERAGEIFS(tblClassScores[الدرجات],tblClassScores[الفصل الدراسي],الحسابات!$C10,tblClassScores[النوع],الحسابات!AF$5)*إعدادات!H13,\"\")","v":""},{"$f":"IFERROR(AVERAGEIFS(tblClassScores[الدرجات],tblClassScores[الفصل الدراسي],الحسابات!$C10,tblClassScores[النوع],الحسابات!AG$5)*إعدادات!I13,\"\")","v":0.15000000000000002},{"$f":"IFERROR(AVERAGEIFS(tblClassScores[الدرجات],tblClassScores[الفصل الدراسي],الحسابات!$C10,tblClassScores[النوع],الحسابات!AH$5)*إعدادات!J13,\"\")","v":""},{"$f":"IFERROR(AVERAGEIFS(tblClassScores[الدرجات],tblClassScores[الفصل الدراسي],الحسابات!$C10,tblClassScores[النوع],الحسابات!AI$5)*إعدادات!K13,\"\")","v":""},0.15000000000000002,{"$f":"SUMIFS(إعدادات!E13:K13,الحسابات!AC10:AI10,\">0\")","v":0.2},{"v":0.7500000000000001,"d":"75%"},2,"C"]
[null,null,{"$f":"IF(إعدادات!C14=\"\",\"\",إعدادات!C14)","v":"الأسبانية"},{"v":0.5,"d":"50%"},"","","","","","","","","","","","","","","","","","","","","","","","",{"$f":"IFERROR(AVERAGEIFS(tblClassScores[الدرجات],tblClassScores[الفصل الدراسي],الحسابات!$C11,tblClassScores[النوع],الحسابات!AC$5)*إعدادات!E14,\"\")","v":0.05},{"$f":"IFERROR(AVERAGEIFS(tblClassScores[الدرجات],tblClassScores[الفصل الدراسي],الحسابات!$C11,tblClassScores[النوع],الحسابات!AD$5)*إعدادات!F14,\"\")","v":""},{"$f":"IFERROR(AVERAGEIFS(tblClassScores[الدرجات],tblClassScores[الفصل الدراسي],الحسابات!$C11,tblClassScores[النوع],الحسابات!AE$5)*إعدادات!G14,\"\")","v":""},{"$f":"IFERROR(AVERAGEIFS(tblClassScores[الدرجات],tblClassScores[الفصل الدراسي],الحسابات!$C11,tblClassScores[النوع],الحسابات!AF$5)*إعدادات!H14,\"\")","v":""},{"$f":"IFERROR(AVERAGEIFS(tblClassScores[الدرجات],tblClassScores[الفصل الدراسي],الحسابات!$C11,tblClassScores[النوع],الحسابات!AG$5)*إعدادات!I14,\"\")","v":""},{"$f":"IFERROR(AVERAGEIFS(tblClassScores[الدرجات],tblClassScores[الفصل الدراسي],الحسابات!$C11,tblClassScores[النوع],الحسابات!AH$5)*إعدادات!J14,\"\")","v":""},{"$f":"IFERROR(AVERAGEIFS(tblClassScores[الدرجات],tblClassScores[الفصل الدراسي],الحسابات!$C11,tblClassScores[النوع],الحسابات!AI$5)*إعدادات!K14,\"\")","v":""},0.05,{"$f":"SUMIFS(إعدادات!E14:K14,الحسابات!AC11:AI11,\">0\")","v":0.1},{"v":0.5,"d":"50%"},0,"F"]
[null,null,{"$f":"IF(إعدادات!C15=\"\",\"\",إعدادات!C15)","v":"الإنشاء"},{"v":0.95,"d":"95%"},"","","","","","","","","","","","","","","","","","","","","","","","",{"$f":"IFERROR(AVERAGEIFS(tblClassScores[الدرجات],tblClassScores[الفصل الدراسي],الحسابات!$C12,tblClassScores[النوع],الحسابات!AC$5)*إعدادات!E15,\"\")","v":""},{"$f":"IFERROR(AVERAGEIFS(tblClassScores[الدرجات],tblClassScores[الفصل الدراسي],الحسابات!$C12,tblClassScores[النوع],الحسابات!AD$5)*إعدادات!F15,\"\")","v":0.1425},{"$f":"IFERROR(AVERAGEIFS(tblClassScores[الدرجات],tblClassScores[الفصل الدراسي],الحسابات!$C12,tblClassScores[النوع],الحسابات!AE$5)*إعدادات!G15,\"\")","v":""},{"$f":"IFERROR(AVERAGEIFS(tblClassScores[الدرجات],tblClassScores[الفصل الدراسي],الحسابات!$C12,tblClassScores[النوع],الحسابات!AF$5)*إعدادات!H15,\"\")","v":""},{"$f":"IFERROR(AVERAGEIFS(tblClassScores[الدرجات],tblClassScores[الفصل الدراسي],الحسابات!$C12,tblClassScores[النوع],الحسابات!AG$5)*إعدادات!I15,\"\")","v":""},{"$f":"IFERROR(AVERAGEIFS(tblClassScores[الدرجات],tblClassScores[الفصل الدراسي],الحسابات!$C12,tblClassScores[النوع],الحسابات!AH$5)*إعدادات!J15,\"\")","v":""},{"$f":"IFERROR(AVERAGEIFS(tblClassScores[الدرجات],tblClassScores[الفصل الدراسي],الحسابات!$C12,tblClassScores[النوع],الحسابات!AI$5)*إعدادات!K15,\"\")","v":""},0.1425,{"$f":"SUMIFS(إعدادات!E15:K15,الحسابات!AC12:AI12,\">0\")","v":0.15},{"v":0.95,"d":"95%"},4,"A"]
[null,null,{"$f":"IF(إعدادات!C16=\"\",\"\",إعدادات!C16)","v":""},"","","","","","","","","","","","","","","","","","","","","","","","","",{"$f":"IFERROR(AVERAGEIFS(tblClassScores[الدرجات],tblClassScores[الفصل الدراسي],الحسابات!$C13,tblClassScores[النوع],الحسابات!AC$5)*إعدادات!E16,\"\")","v":""},{"$f":"IFERROR(AVERAGEIFS(tblClassScores[الدرجات],tblClassScores[الفصل الدراسي],الحسابات!$C13,tblClassScores[النوع],الحسابات!AD$5)*إعدادات!F16,\"\")","v":""},{"$f":"IFERROR(AVERAGEIFS(tblClassScores[الدرجات],tblClassScores[الفصل الدراسي],الحسابات!$C13,tblClassScores[النوع],الحسابات!AE$5)*إعدادات!G16,\"\")","v":""},{"$f":"IFERROR(AVERAGEIFS(tblClassScores[الدرجات],tblClassScores[الفصل الدراسي],الحسابات!$C13,tblClassScores[النوع],الحسابات!AF$5)*إعدادات!H16,\"\")","v":""},{"$f":"IFERROR(AVERAGEIFS(tblClassScores[الدرجات],tblClassScores[الفصل الدراسي],الحسابات!$C13,tblClassScores[النوع],الحسابات!AG$5)*إعدادات!I16,\"\")","v":""},{"$f":"IFERROR(AVERAGEIFS(tblClassScores[الدرجات],tblClassScores[الفصل الدراسي],الحسابات!$C13,tblClassScores[النوع],الحسابات!AH$5)*إعدادات!J16,\"\")","v":""},{"$f":"IFERROR(AVERAGEIFS(tblClassScores[الدرجات],tblClassScores[الفصل الدراسي],الحسابات!$C13,tblClassScores[النوع],الحسابات!AI$5)*إعدادات!K16,\"\")","v":""},0,{"$f":"SUMIFS(إعدادات!E16:K16,الحسابات!AC13:AI13,\">0\")","v":0},"","",""]
[null,null,{"$f":"IF(إعدادات!C17=\"\",\"\",إعدادات!C17)","v":""},"","","","","","","","","","","","","","","","","","","","","","","","","",{"$f":"IFERROR(AVERAGEIFS(tblClassScores[الدرجات],tblClassScores[الفصل الدراسي],الحسابات!$C14,tblClassScores[النوع],الحسابات!AC$5)*إعدادات!E17,\"\")","v":""},{"$f":"IFERROR(AVERAGEIFS(tblClassScores[الدرجات],tblClassScores[الفصل الدراسي],الحسابات!$C14,tblClassScores[النوع],الحسابات!AD$5)*إعدادات!F17,\"\")","v":""},{"$f":"IFERROR(AVERAGEIFS(tblClassScores[الدرجات],tblClassScores[الفصل الدراسي],الحسابات!$C14,tblClassScores[النوع],الحسابات!AE$5)*إعدادات!G17,\"\")","v":""},{"$f":"IFERROR(AVERAGEIFS(tblClassScores[الدرجات],tblClassScores[الفصل الدراسي],الحسابات!$C14,tblClassScores[النوع],الحسابات!AF$5)*إعدادات!H17,\"\")","v":""},{"$f":"IFERROR(AVERAGEIFS(tblClassScores[الدرجات],tblClassScores[الفصل الدراسي],الحسابات!$C14,tblClassScores[النوع],الحسابات!AG$5)*إعدادات!I17,\"\")","v":""},{"$f":"IFERROR(AVERAGEIFS(tblClassScores[الدرجات],tblClassScores[الفصل الدراسي],الحسابات!$C14,tblClassScores[النوع],الحسابات!AH$5)*إعدادات!J17,\"\")","v":""},{"$f":"IFERROR(AVERAGEIFS(tblClassScores[الدرجات],tblClassScores[الفصل الدراسي],الحسابات!$C14,tblClassScores[النوع],الحسابات!AI$5)*إعدادات!K17,\"\")","v":""},0,{"$f":"SUMIFS(إعدادات!E17:K17,الحسابات!AC14:AI14,\">0\")","v":0},"","",""]
[null,null,{"$f":"IF(إعدادات!C18=\"\",\"\",إعدادات!C18)","v":""},"","","","","","","","","","","","","","","","","","","","","","","","","",{"$f":"IFERROR(AVERAGEIFS(tblClassScores[الدرجات],tblClassScores[الفصل الدراسي],الحسابات!$C15,tblClassScores[النوع],الحسابات!AC$5)*إعدادات!E18,\"\")","v":""},{"$f":"IFERROR(AVERAGEIFS(tblClassScores[الدرجات],tblClassScores[الفصل الدراسي],الحسابات!$C15,tblClassScores[النوع],الحسابات!AD$5)*إعدادات!F18,\"\")","v":""},{"$f":"IFERROR(AVERAGEIFS(tblClassScores[الدرجات],tblClassScores[الفصل الدراسي],الحسابات!$C15,tblClassScores[النوع],الحسابات!AE$5)*إعدادات!G18,\"\")","v":""},{"$f":"IFERROR(AVERAGEIFS(tblClassScores[الدرجات],tblClassScores[الفصل الدراسي],الحسابات!$C15,tblClassScores[النوع],الحسابات!AF$5)*إعدادات!H18,\"\")","v":""},{"$f":"IFERROR(AVERAGEIFS(tblClassScores[الدرجات],tblClassScores[الفصل الدراسي],الحسابات!$C15,tblClassScores[النوع],الحسابات!AG$5)*إعدادات!I18,\"\")","v":""},{"$f":"IFERROR(AVERAGEIFS(tblClassScores[الدرجات],tblClassScores[الفصل الدراسي],الحسابات!$C15,tblClassScores[النوع],الحسابات!AH$5)*إعدادات!J18,\"\")","v":""},{"$f":"IFERROR(AVERAGEIFS(tblClassScores[الدرجات],tblClassScores[الفصل الدراسي],الحسابات!$C15,tblClassScores[النوع],الحسابات!AI$5)*إعدادات!K18,\"\")","v":""},0,{"$f":"SUMIFS(إعدادات!E18:K18,الحسابات!AC15:AI15,\">0\")","v":0},"","",""]
{"$rows_left_out":642}