{"text_format":"3","workbook":"xlsx","n_sheets":2,"sheets":["قائمة البقالة","العمليات الحسابية"],"not_rendered":{"defined_names":4},"read":"whole","date_system":"1900"}

{"sheet":"قائمة البقالة","index":0,"n_rows":21,"n_cols":13,"rows_kept":21,"merged":[[0,1,0,11],[0,12,1,12],[1,1,1,11],[4,12,5,12],[7,12,8,12],[10,12,11,12],[13,12,14,12]]}
[{"$nulls":12},{"$f":"'العمليات الحسابية'!M9","v":"منتجات الألبان الإجمالي"}]
[null," قائمة البقالة"]
[null,null,"المهام المكتملة","العنصر","المتجر","الفئة","الكمية","الوحدة","سعر الوحدة","الإجمالي","تعليق",null,{"$f":"'العمليات الحسابية'!L9","v":37}]
[null,null,1,"برتقال","البقالة","الفاكهة والخضراوات",2,"كيلو جرام",{"v":2.99,"d":"ر.س.‏ 2.99"},{"$f":"IFERROR(القائمة[الكمية]*القائمة[سعر الوحدة],\"\")","v":{"v":5.98,"d":"ر.س.‏ 5.98"}},null,null,{"$f":"'العمليات الحسابية'!M8","v":"الفاكهة والخضراوات الإجمالي"}]
[{"$nulls":3},"تفاح","فاكهة البستان","الفاكهة والخضراوات",3,"كيلو جرام",{"v":1.99,"d":"ر.س.‏ 1.99"},{"$f":"IFERROR(القائمة[الكمية]*القائمة[سعر الوحدة],\"\")","v":{"v":5.97,"d":"ر.س.‏ 5.97"}},"أمتلك قسيمة",null,{"$f":"'العمليات الحسابية'!L8","v":45}]
[{"$nulls":3},"موز","البقالة","الفاكهة والخضراوات",1,"حزمة",{"v":3.99,"d":"ر.س.‏ 3.99"},{"$f":"IFERROR(القائمة[الكمية]*القائمة[سعر الوحدة],\"\")","v":{"v":3.99,"d":"ر.س.‏ 3.99"}}]
[{"$nulls":3},"خس","السوق","الفاكهة والخضراوات",2,"رأس",{"v":2.29,"d":"ر.س.‏ 2.29"},{"$f":"IFERROR(القائمة[الكمية]*القائمة[سعر الوحدة],\"\")","v":{"v":4.58,"d":"ر.س.‏ 4.58"}},null,null,{"$f":"'العمليات الحسابية'!M7","v":"اللحوم الإجمالي"}]
[{"$nulls":3},"طماطم","السوق","الفاكهة والخضراوات",4,"كيلو جرام",{"v":3.49,"d":"ر.س.‏ 3.49"},{"$f":"IFERROR(القائمة[الكمية]*القائمة[سعر الوحدة],\"\")","v":{"v":13.96,"d":"ر.س.‏ 13.96"}},null,null,{"$f":"'العمليات الحسابية'!L7","v":80}]
[{"$nulls":3},"قرع","السوق","الفاكهة والخضراوات",2,"كل واحدة",{"v":1.5,"d":"ر.س.‏ 1.50"},{"$f":"IFERROR(القائمة[الكمية]*القائمة[سعر الوحدة],\"\")","v":{"v":3,"d":"ر.س.‏ 3.00"}}]
[{"$nulls":3},"كرفس","البقالة","الفاكهة والخضراوات",2,"حزمة",{"v":1.99,"d":"ر.س.‏ 1.99"},{"$f":"IFERROR(القائمة[الكمية]*القائمة[سعر الوحدة],\"\")","v":{"v":3.98,"d":"ر.س.‏ 3.98"}},null,null,{"$f":"'العمليات الحسابية'!M6","v":"المأكولات البحرية الإجمالي"}]
[{"$nulls":3},"خيار","السوق","الفاكهة والخضراوات",1,"كيلو جرام",{"v":2.29,"d":"ر.س.‏ 2.29"},{"$f":"IFERROR(القائمة[الكمية]*القائمة[سعر الوحدة],\"\")","v":{"v":2.29,"d":"ر.س.‏ 2.29"}},null,null,{"$f":"'العمليات الحسابية'!L6","v":109}]
[{"$nulls":3},"فطر","البقالة","الفاكهة والخضراوات",0.5,"كيلو جرام",{"v":2.25,"d":"ر.س.‏ 2.25"},{"$f":"IFERROR(القائمة[الكمية]*القائمة[سعر الوحدة],\"\")","v":{"v":1.125,"d":"ر.س.‏ 1.13"}},"فطر كبير"]
[{"$nulls":3},"حليب ","توصيل للمنزل","منتجات الألبان",2,"لتر",{"v":3.99,"d":"ر.س.‏ 3.99"},{"$f":"IFERROR(القائمة[الكمية]*القائمة[سعر الوحدة],\"\")","v":{"v":7.98,"d":"ر.س.‏ 7.98"}},null,null,{"$f":"'العمليات الحسابية'!M3","v":"المبالغ الإجمالية الأخرى"}]
[{"$nulls":3},"جُبن","توصيل للمنزل","منتجات الألبان",1,"كيلو جرام",{"v":9.99,"d":"ر.س.‏ 9.99"},{"$f":"IFERROR(القائمة[الكمية]*القائمة[سعر الوحدة],\"\")","v":{"v":9.99,"d":"ر.س.‏ 9.99"}},"مجموعة من قوالب الجبن",null,{"$f":"'العمليات الحسابية'!L3","v":0}]
[{"$nulls":3},"بيض","توصيل للمنزل","منتجات الألبان",2,"دستة",{"v":3.5,"d":"ر.س.‏ 3.50"},{"$f":"IFERROR(القائمة[الكمية]*القائمة[سعر الوحدة],\"\")","v":{"v":7,"d":"ر.س.‏ 7.00"}}]
[{"$nulls":3},"جُبن كريمي","توصيل للمنزل","منتجات الألبان",1,"16 جرام",{"v":3.89,"d":"ر.س.‏ 3.89"},{"$f":"IFERROR(القائمة[الكمية]*القائمة[سعر الوحدة],\"\")","v":{"v":3.89,"d":"ر.س.‏ 3.89"}},null,null,{"$f":"'العمليات الحسابية'!M4","v":"المبلغ الإجمالي للبقالة"}]
[{"$nulls":3},"كريمة حامضية","توصيل للمنزل","منتجات الألبان",1,"8 جرام",{"v":2.99,"d":"ر.س.‏ 2.99"},{"$f":"IFERROR(القائمة[الكمية]*القائمة[سعر الوحدة],\"\")","v":{"v":2.99,"d":"ر.س.‏ 2.99"}},null,null,{"$f":"المبلغ_الإجمالي_للبقالة","v":271}]
[{"$nulls":3},"زبادي","البقالة","منتجات الألبان",1,"16 جرام",{"v":4.99,"d":"ر.س.‏ 4.99"},{"$f":"IFERROR(القائمة[الكمية]*القائمة[سعر الوحدة],\"\")","v":{"v":4.99,"d":"ر.س.‏ 4.99"}},"يوناني بالعسل"]
[{"$nulls":3},"لحم بقري","السوق","اللحوم",10,"كيلو جرام",{"v":7.99,"d":"ر.س.‏ 7.99"},{"$f":"IFERROR(القائمة[الكمية]*القائمة[سعر الوحدة],\"\")","v":{"v":79.9,"d":"ر.س.‏ 79.90"}},"شرائح اللحم المقدد"]
[{"$nulls":3},"السالمون","سوق الأسماك","المأكولات البحرية",6,"كيلو جرام",{"v":8.99,"d":"ر.س.‏ 8.99"},{"$f":"IFERROR(القائمة[الكمية]*القائمة[سعر الوحدة],\"\")","v":{"v":53.94,"d":"ر.س.‏ 53.94"}}]
[{"$nulls":3},"أرجل السلطعون","سوق الأسماك","المأكولات البحرية",5,"كيلو جرام",{"v":10.99,"d":"ر.س.‏ 10.99"},{"$f":"IFERROR(القائمة[الكمية]*القائمة[سعر الوحدة],\"\")","v":{"v":54.95,"d":"ر.س.‏ 54.95"}}]

{"sheet":"العمليات الحسابية","index":1,"n_rows":21,"n_cols":13,"rows_kept":21,"hidden":true}
["*** تبقى هذه الورقة مخفية ***"]
[]
[{"$nulls":10},{"$f":"SUM('قائمة البقالة'!$J$4:$J$21)-SUM(K6:K9)","v":{"v":0,"d":"ر.س.‏ 0.00"}},{"$f":"ROUND(K3,0)","v":{"v":0,"d":"ر.س.‏ 0"}},"المبالغ الإجمالية الأخرى"]
[{"$nulls":11},{"$f":"ROUNDUP(SUM('قائمة البقالة'!$J$4:$J$21),0)","v":{"v":271,"d":"ر.س.‏ 271"}},"المبلغ الإجمالي للبقالة"]
[]
[{"$nulls":4},{"$f":"IFERROR(INDEX('قائمة البقالة'!$F$4:$F$21,MATCH(,COUNTIF($E$5:E5,'قائمة البقالة'!$F$4:$F$21),)),\"\")","v":"الفاكهة والخضراوات"},{"$f":"SUMIFS('قائمة البقالة'!$J$4:$J$21,'قائمة البقالة'!$F$4:$F$21,E6)","v":44.875},{"$f":"F6+ROW()/1000000","v":44.875006},{"$f":"LARGE($G$6:$G$21,1)","v":108.890009},{"$f":"MATCH(H6,$G$6:$G$21,0)","v":4},{"$f":"INDEX($E$6:$E$21,$I6)","v":"المأكولات البحرية"},{"$f":"INDEX($F$6:$F$21,$I6)","v":{"v":108.89,"d":"ر.س.‏ 108.89"}},{"$f":"ROUND(K6,0)","v":{"v":109,"d":"ر.س.‏ 109"}},{"$f":"UPPER(J6) & \" الإجمالي\"","v":"المأكولات البحرية الإجمالي"}]
[{"$nulls":4},{"$f":"IFERROR(INDEX('قائمة البقالة'!$F$4:$F$21,MATCH(,COUNTIF($E$5:E6,'قائمة البقالة'!$F$4:$F$21),)),\"\")","v":"منتجات الألبان"},{"$f":"SUMIFS('قائمة البقالة'!$J$4:$J$21,'قائمة البقالة'!$F$4:$F$21,E7)","v":36.84},{"$f":"F7+ROW()/1000000","v":36.840007},{"$f":"LARGE($G$6:$G$21,2)","v":79.900008},{"$f":"MATCH(H7,$G$6:$G$21,0)","v":3},{"$f":"INDEX($E$6:$E$21,$I7)","v":"اللحوم"},{"$f":"INDEX($F$6:$F$21,$I7)","v":{"v":79.9,"d":"ر.س.‏ 79.90"}},{"$f":"ROUND(K7,0)","v":{"v":80,"d":"ر.س.‏ 80"}},{"$f":"UPPER(J7) & \" الإجمالي\"","v":"اللحوم الإجمالي"}]
[{"$nulls":4},{"$f":"IFERROR(INDEX('قائمة البقالة'!$F$4:$F$21,MATCH(,COUNTIF($E$5:E7,'قائمة البقالة'!$F$4:$F$21),)),\"\")","v":"اللحوم"},{"$f":"SUMIFS('قائمة البقالة'!$J$4:$J$21,'قائمة البقالة'!$F$4:$F$21,E8)","v":79.9},79.900008,{"$f":"LARGE($G$6:$G$21,3)","v":44.875006},{"$f":"MATCH(H8,$G$6:$G$21,0)","v":1},{"$f":"INDEX($E$6:$E$21,$I8)","v":"الفاكهة والخضراوات"},{"$f":"INDEX($F$6:$F$21,$I8)","v":{"v":44.875,"d":"ر.س.‏ 44.88"}},{"$f":"ROUND(K8,0)","v":{"v":45,"d":"ر.س.‏ 45"}},{"$f":"UPPER(J8) & \" الإجمالي\"","v":"الفاكهة والخضراوات الإجمالي"}]
[{"$nulls":4},{"$f":"IFERROR(INDEX('قائمة البقالة'!$F$4:$F$21,MATCH(,COUNTIF($E$5:E8,'قائمة البقالة'!$F$4:$F$21),)),\"\")","v":"المأكولات البحرية"},{"$f":"SUMIFS('قائمة البقالة'!$J$4:$J$21,'قائمة البقالة'!$F$4:$F$21,E9)","v":108.89},{"$f":"F9+ROW()/1000000","v":108.890009},{"$f":"LARGE($G$6:$G$21,4)","v":36.840007},{"$f":"MATCH(H9,$G$6:$G$21,0)","v":2},{"$f":"INDEX($E$6:$E$21,$I9)","v":"منتجات الألبان"},{"$f":"INDEX($F$6:$F$21,$I9)","v":{"v":36.84,"d":"ر.س.‏ 36.84"}},{"$f":"ROUND(K9,0)","v":{"v":37,"d":"ر.س.‏ 37"}},{"$f":"UPPER(J9) & \" الإجمالي\"","v":"منتجات الألبان الإجمالي"}]
[{"$nulls":4},{"$f":"IFERROR(INDEX('قائمة البقالة'!$F$4:$F$21,MATCH(,COUNTIF($E$5:E9,'قائمة البقالة'!$F$4:$F$21),)),\"\")","v":""},{"$f":"SUMIFS('قائمة البقالة'!$J$4:$J$21,'قائمة البقالة'!$F$4:$F$21,E10)","v":0},1e-05]
[{"$nulls":4},{"$f":"IFERROR(INDEX('قائمة البقالة'!$F$4:$F$21,MATCH(,COUNTIF($E$5:E10,'قائمة البقالة'!$F$4:$F$21),)),\"\")","v":""},{"$f":"SUMIFS('قائمة البقالة'!$J$4:$J$21,'قائمة البقالة'!$F$4:$F$21,E11)","v":0},1.1E-5]
[{"$nulls":4},{"$f":"IFERROR(INDEX('قائمة البقالة'!$F$4:$F$21,MATCH(,COUNTIF($E$5:E11,'قائمة البقالة'!$F$4:$F$21),)),\"\")","v":""},{"$f":"SUMIFS('قائمة البقالة'!$J$4:$J$21,'قائمة البقالة'!$F$4:$F$21,E12)","v":0},1.2E-5]
[{"$nulls":4},{"$f":"IFERROR(INDEX('قائمة البقالة'!$F$4:$F$21,MATCH(,COUNTIF($E$5:E12,'قائمة البقالة'!$F$4:$F$21),)),\"\")","v":""},{"$f":"SUMIFS('قائمة البقالة'!$J$4:$J$21,'قائمة البقالة'!$F$4:$F$21,E13)","v":0},1.3e-05]
[{"$nulls":4},{"$f":"IFERROR(INDEX('قائمة البقالة'!$F$4:$F$21,MATCH(,COUNTIF($E$5:E13,'قائمة البقالة'!$F$4:$F$21),)),\"\")","v":""},{"$f":"SUMIFS('قائمة البقالة'!$J$4:$J$21,'قائمة البقالة'!$F$4:$F$21,E14)","v":0},1.4E-5]
[{"$nulls":4},{"$f":"IFERROR(INDEX('قائمة البقالة'!$F$4:$F$21,MATCH(,COUNTIF($E$5:E14,'قائمة البقالة'!$F$4:$F$21),)),\"\")","v":""},{"$f":"SUMIFS('قائمة البقالة'!$J$4:$J$21,'قائمة البقالة'!$F$4:$F$21,E15)","v":0},1.5E-5]
[{"$nulls":4},{"$f":"IFERROR(INDEX('قائمة البقالة'!$F$4:$F$21,MATCH(,COUNTIF($E$5:E15,'قائمة البقالة'!$F$4:$F$21),)),\"\")","v":""},{"$f":"SUMIFS('قائمة البقالة'!$J$4:$J$21,'قائمة البقالة'!$F$4:$F$21,E16)","v":0},1.6e-05]
[{"$nulls":4},{"$f":"IFERROR(INDEX('قائمة البقالة'!$F$4:$F$21,MATCH(,COUNTIF($E$5:E16,'قائمة البقالة'!$F$4:$F$21),)),\"\")","v":""},{"$f":"SUMIFS('قائمة البقالة'!$J$4:$J$21,'قائمة البقالة'!$F$4:$F$21,E17)","v":0},1.7E-5]
[{"$nulls":4},{"$f":"IFERROR(INDEX('قائمة البقالة'!$F$4:$F$21,MATCH(,COUNTIF($E$5:E17,'قائمة البقالة'!$F$4:$F$21),)),\"\")","v":""},{"$f":"SUMIFS('قائمة البقالة'!$J$4:$J$21,'قائمة البقالة'!$F$4:$F$21,E18)","v":0},1.8E-5]
[{"$nulls":4},{"$f":"IFERROR(INDEX('قائمة البقالة'!$F$4:$F$21,MATCH(,COUNTIF($E$5:E18,'قائمة البقالة'!$F$4:$F$21),)),\"\")","v":""},{"$f":"SUMIFS('قائمة البقالة'!$J$4:$J$21,'قائمة البقالة'!$F$4:$F$21,E19)","v":0},1.9e-05]
[{"$nulls":4},{"$f":"IFERROR(INDEX('قائمة البقالة'!$F$4:$F$21,MATCH(,COUNTIF($E$5:E19,'قائمة البقالة'!$F$4:$F$21),)),\"\")","v":""},{"$f":"SUMIFS('قائمة البقالة'!$J$4:$J$21,'قائمة البقالة'!$F$4:$F$21,E20)","v":0},2e-05]
[{"$nulls":4},{"$f":"IFERROR(INDEX('قائمة البقالة'!$F$4:$F$21,MATCH(,COUNTIF($E$5:E20,'قائمة البقالة'!$F$4:$F$21),)),\"\")","v":""},{"$f":"SUMIFS('قائمة البقالة'!$J$4:$J$21,'قائمة البقالة'!$F$4:$F$21,E21)","v":0},2.1e-05]