{"text_format":"3","workbook":"xlsx","n_sheets":3,"sheets":["إدخال البيانات","تقرير المبيعات","التنبؤ بالمبيعات"],"not_rendered":{"charts":5,"defined_names":7,"pivot_tables":1},"read":"whole","date_system":"1900"}

{"sheet":"إدخال البيانات","index":0,"n_rows":24,"n_cols":17,"rows_kept":24}
[{"$nulls":9},{"$f":"365*2","v":730}]
[null,"إدخال البيانات الشهرية"]
[{"$nulls":11},"الإجمالي",null,null,"التنبؤ"]
[]
[null,"‎التاريخ","الشركة","المبلغ","المخطط","التكلفة","العائد","الشهر","الربع","السة","MONTH NUM (HIDE)","شهري","ربع سنوي","سنوي","شهري ","ربع سنوي ","سنوي "]
[null,{"$f":"40657+(365*2)","v":"2013-04-23"},"شركة القمر المنير",{"v":6400,"d":"6400.00 ر.س.‏"},{"v":6200,"d":"6200.00 ر.س.‏"},{"v":4450,"d":"4450.00 ر.س.‏"},{"$f":"tblData[[#This Row],[المبلغ]]-tblData[[#This Row],[التكلفة]]","v":{"v":1950,"d":"1950.00 ر.س.‏"}},{"$f":"DATE(YEAR('إدخال البيانات'!$B6),MONTH('إدخال البيانات'!$B6),1)","v":"2013-04-01"},{"$f":"LOOKUP(MONTH('إدخال البيانات'!$H6),{1,1;2,1;3,1;4,2;5,2;6,2;7,3;8,3;9,3;10,4;11,4;12,4})","v":{"v":2,"d":"الربع 2"}},{"$f":"YEAR('إدخال البيانات'!$B6)","v":2013},{"$f":"MONTH(tblData[[#This Row],[‎التاريخ]])","v":4},{"$f":"SUMIFS(tblData[المبلغ],tblData[‎التاريخ],\">=\"&EOMONTH(tblData[[#This Row],[‎التاريخ]],-1)+1,tblData[‎التاريخ],\"<=\"&EOMONTH(tblData[[#This Row],[‎التاريخ]],0))","v":{"v":14600,"d":"14600.00 ر.س.‏"}},{"$f":"SUMIFS(tblData[المبلغ],tblData[‎التاريخ],\">=\"&DATE(YEAR(tblData[[#This Row],[‎التاريخ]]),1,1),tblData[‎التاريخ],\"<=\"&DATE(YEAR(tblData[[#This Row],[‎التاريخ]]),12,31),tblData[الربع],tblData[[#This Row],[الربع]])","v":{"v":50800,"d":"50800.00 ر.س.‏"}},{"$f":"SUMIFS(tblData[المبلغ],tblData[‎التاريخ],\">=\"&DATE(YEAR(tblData[[#This Row],[‎التاريخ]]),1,1),tblData[‎التاريخ],\"<=\"&DATE(YEAR(tblData[[#This Row],[‎التاريخ]]),12,31))","v":{"v":143800,"d":"143800.00 ر.س.‏"}},{"$f":"IFERROR(TREND($L$6:INDEX($L:$L,ROW(),1),$K$6:INDEX($K:$K,ROW(),1),IF(MONTH(tblData[[#This Row],[‎التاريخ]])=12,13,MONTH(tblData[[#This Row],[‎التاريخ]])+1)),\"\")","v":{"v":14600,"d":"14600.00 ر.س.‏"}},{"$f":"IFERROR(TREND($M$6:INDEX($M:$M,ROW(),1),$I$6:INDEX($I:$I,ROW(),1),IF(tblData[[#This Row],[الربع]]=4,5,tblData[[#This Row],[الربع]]+1)),\"\")","v":{"v":50800,"d":"50800.00 ر.س.‏"}},{"$f":"IFERROR(TREND($N$6:INDEX($N:$N,ROW(),1),$J$6:INDEX($J:$J,ROW(),1),tblData[[#This Row],[السة]]+1),\"\")","v":{"v":143800,"d":"143800.00 ر.س.‏"}}]
[null,{"$f":"40659+(365*2)","v":"2013-04-25"},"القمر المنير للصيدلة",{"v":8200,"d":"8200.00 ر.س.‏"},{"v":8000,"d":"8000.00 ر.س.‏"},{"v":6400,"d":"6400.00 ر.س.‏"},{"$f":"tblData[[#This Row],[المبلغ]]-tblData[[#This Row],[التكلفة]]","v":{"v":1800,"d":"1800.00 ر.س.‏"}},{"$f":"DATE(YEAR('إدخال البيانات'!$B7),MONTH('إدخال البيانات'!$B7),1)","v":"2013-04-01"},{"$f":"LOOKUP(MONTH('إدخال البيانات'!$H7),{1,1;2,1;3,1;4,2;5,2;6,2;7,3;8,3;9,3;10,4;11,4;12,4})","v":{"v":2,"d":"الربع 2"}},{"$f":"YEAR('إدخال البيانات'!$B7)","v":2013},{"$f":"MONTH(tblData[[#This Row],[‎التاريخ]])","v":4},{"$f":"SUMIFS(tblData[المبلغ],tblData[‎التاريخ],\">=\"&EOMONTH(tblData[[#This Row],[‎التاريخ]],-1)+1,tblData[‎التاريخ],\"<=\"&EOMONTH(tblData[[#This Row],[‎التاريخ]],0))","v":{"v":14600,"d":"14600.00 ر.س.‏"}},{"$f":"SUMIFS(tblData[المبلغ],tblData[‎التاريخ],\">=\"&DATE(YEAR(tblData[[#This Row],[‎التاريخ]]),1,1),tblData[‎التاريخ],\"<=\"&DATE(YEAR(tblData[[#This Row],[‎التاريخ]]),12,31),tblData[الربع],tblData[[#This Row],[الربع]])","v":{"v":50800,"d":"50800.00 ر.س.‏"}},{"$f":"SUMIFS(tblData[المبلغ],tblData[‎التاريخ],\">=\"&DATE(YEAR(tblData[[#This Row],[‎التاريخ]]),1,1),tblData[‎التاريخ],\"<=\"&DATE(YEAR(tblData[[#This Row],[‎التاريخ]]),12,31))","v":{"v":143800,"d":"143800.00 ر.س.‏"}},{"$f":"IFERROR(TREND($L$6:INDEX($L:$L,ROW(),1),$K$6:INDEX($K:$K,ROW(),1),IF(MONTH(tblData[[#This Row],[‎التاريخ]])=12,13,MONTH(tblData[[#This Row],[‎التاريخ]])+1)),\"\")","v":{"v":14600,"d":"14600.00 ر.س.‏"}},{"$f":"IFERROR(TREND($M$6:INDEX($M:$M,ROW(),1),$I$6:INDEX($I:$I,ROW(),1),IF(tblData[[#This Row],[الربع]]=4,5,tblData[[#This Row],[الربع]]+1)),\"\")","v":{"v":50800,"d":"50800.00 ر.س.‏"}},{"$f":"IFERROR(TREND($N$6:INDEX($N:$N,ROW(),1),$J$6:INDEX($J:$J,ROW(),1),tblData[[#This Row],[السة]]+1),\"\")","v":{"v":143800,"d":"143800.00 ر.س.‏"}}]
[null,{"$f":"40671+(365*2)","v":"2013-05-07"},"الشركة الوطنية للإنتاج",{"v":4400,"d":"4400.00 ر.س.‏"},{"v":4200,"d":"4200.00 ر.س.‏"},{"v":2600,"d":"2600.00 ر.س.‏"},{"$f":"tblData[[#This Row],[المبلغ]]-tblData[[#This Row],[التكلفة]]","v":{"v":1800,"d":"1800.00 ر.س.‏"}},{"$f":"DATE(YEAR('إدخال البيانات'!$B8),MONTH('إدخال البيانات'!$B8),1)","v":"2013-05-01"},{"$f":"LOOKUP(MONTH('إدخال البيانات'!$H8),{1,1;2,1;3,1;4,2;5,2;6,2;7,3;8,3;9,3;10,4;11,4;12,4})","v":{"v":2,"d":"الربع 2"}},{"$f":"YEAR('إدخال البيانات'!$B8)","v":2013},{"$f":"MONTH(tblData[[#This Row],[‎التاريخ]])","v":5},{"$f":"SUMIFS(tblData[المبلغ],tblData[‎التاريخ],\">=\"&EOMONTH(tblData[[#This Row],[‎التاريخ]],-1)+1,tblData[‎التاريخ],\"<=\"&EOMONTH(tblData[[#This Row],[‎التاريخ]],0))","v":{"v":21800,"d":"21800.00 ر.س.‏"}},{"$f":"SUMIFS(tblData[المبلغ],tblData[‎التاريخ],\">=\"&DATE(YEAR(tblData[[#This Row],[‎التاريخ]]),1,1),tblData[‎التاريخ],\"<=\"&DATE(YEAR(tblData[[#This Row],[‎التاريخ]]),12,31),tblData[الربع],tblData[[#This Row],[الربع]])","v":{"v":50800,"d":"50800.00 ر.س.‏"}},{"$f":"SUMIFS(tblData[المبلغ],tblData[‎التاريخ],\">=\"&DATE(YEAR(tblData[[#This Row],[‎التاريخ]]),1,1),tblData[‎التاريخ],\"<=\"&DATE(YEAR(tblData[[#This Row],[‎التاريخ]]),12,31))","v":{"v":143800,"d":"143800.00 ر.س.‏"}},{"$f":"IFERROR(TREND($L$6:INDEX($L:$L,ROW(),1),$K$6:INDEX($K:$K,ROW(),1),IF(MONTH(tblData[[#This Row],[‎التاريخ]])=12,13,MONTH(tblData[[#This Row],[‎التاريخ]])+1)),\"\")","v":{"v":28999.999999999996,"d":"29000.00 ر.س.‏"}},{"$f":"IFERROR(TREND($M$6:INDEX($M:$M,ROW(),1),$I$6:INDEX($I:$I,ROW(),1),IF(tblData[[#This Row],[الربع]]=4,5,tblData[[#This Row],[الربع]]+1)),\"\")","v":{"v":50800,"d":"50800.00 ر.س.‏"}},{"$f":"IFERROR(TREND($N$6:INDEX($N:$N,ROW(),1),$J$6:INDEX($J:$J,ROW(),1),tblData[[#This Row],[السة]]+1),\"\")","v":{"v":143800,"d":"143800.00 ر.س.‏"}}]
[null,{"$f":"40678+(365*2)","v":"2013-05-14"}," مسرح الشركة الوطنية",{"v":5400,"d":"5400.00 ر.س.‏"},{"v":5500,"d":"5500.00 ر.س.‏"},{"v":4500,"d":"4500.00 ر.س.‏"},{"$f":"tblData[[#This Row],[المبلغ]]-tblData[[#This Row],[التكلفة]]","v":{"v":900,"d":"900.00 ر.س.‏"}},{"$f":"DATE(YEAR('إدخال البيانات'!$B9),MONTH('إدخال البيانات'!$B9),1)","v":"2013-05-01"},{"$f":"LOOKUP(MONTH('إدخال البيانات'!$H9),{1,1;2,1;3,1;4,2;5,2;6,2;7,3;8,3;9,3;10,4;11,4;12,4})","v":{"v":2,"d":"الربع 2"}},{"$f":"YEAR('إدخال البيانات'!$B9)","v":2013},{"$f":"MONTH(tblData[[#This Row],[‎التاريخ]])","v":5},{"$f":"SUMIFS(tblData[المبلغ],tblData[‎التاريخ],\">=\"&EOMONTH(tblData[[#This Row],[‎التاريخ]],-1)+1,tblData[‎التاريخ],\"<=\"&EOMONTH(tblData[[#This Row],[‎التاريخ]],0))","v":{"v":21800,"d":"21800.00 ر.س.‏"}},{"$f":"SUMIFS(tblData[المبلغ],tblData[‎التاريخ],\">=\"&DATE(YEAR(tblData[[#This Row],[‎التاريخ]]),1,1),tblData[‎التاريخ],\"<=\"&DATE(YEAR(tblData[[#This Row],[‎التاريخ]]),12,31),tblData[الربع],tblData[[#This Row],[الربع]])","v":{"v":50800,"d":"50800.00 ر.س.‏"}},{"$f":"SUMIFS(tblData[المبلغ],tblData[‎التاريخ],\">=\"&DATE(YEAR(tblData[[#This Row],[‎التاريخ]]),1,1),tblData[‎التاريخ],\"<=\"&DATE(YEAR(tblData[[#This Row],[‎التاريخ]]),12,31))","v":{"v":143800,"d":"143800.00 ر.س.‏"}},{"$f":"IFERROR(TREND($L$6:INDEX($L:$L,ROW(),1),$K$6:INDEX($K:$K,ROW(),1),IF(MONTH(tblData[[#This Row],[‎التاريخ]])=12,13,MONTH(tblData[[#This Row],[‎التاريخ]])+1)),\"\")","v":{"v":29000,"d":"29000.00 ر.س.‏"}},{"$f":"IFERROR(TREND($M$6:INDEX($M:$M,ROW(),1),$I$6:INDEX($I:$I,ROW(),1),IF(tblData[[#This Row],[الربع]]=4,5,tblData[[#This Row],[الربع]]+1)),\"\")","v":{"v":50800,"d":"50800.00 ر.س.‏"}},{"$f":"IFERROR(TREND($N$6:INDEX($N:$N,ROW(),1),$J$6:INDEX($J:$J,ROW(),1),tblData[[#This Row],[السة]]+1),\"\")","v":{"v":143800,"d":"143800.00 ر.س.‏"}}]
[null,{"$f":"40678+(365*2)","v":"2013-05-14"},"الشركة الوطنية",{"v":5800,"d":"5800.00 ر.س.‏"},{"v":6000,"d":"6000.00 ر.س.‏"},{"v":4500,"d":"4500.00 ر.س.‏"},{"$f":"tblData[[#This Row],[المبلغ]]-tblData[[#This Row],[التكلفة]]","v":{"v":1300,"d":"1300.00 ر.س.‏"}},{"$f":"DATE(YEAR('إدخال البيانات'!$B10),MONTH('إدخال البيانات'!$B10),1)","v":"2013-05-01"},{"$f":"LOOKUP(MONTH('إدخال البيانات'!$H10),{1,1;2,1;3,1;4,2;5,2;6,2;7,3;8,3;9,3;10,4;11,4;12,4})","v":{"v":2,"d":"الربع 2"}},{"$f":"YEAR('إدخال البيانات'!$B10)","v":2013},{"$f":"MONTH(tblData[[#This Row],[‎التاريخ]])","v":5},{"$f":"SUMIFS(tblData[المبلغ],tblData[‎التاريخ],\">=\"&EOMONTH(tblData[[#This Row],[‎التاريخ]],-1)+1,tblData[‎التاريخ],\"<=\"&EOMONTH(tblData[[#This Row],[‎التاريخ]],0))","v":{"v":21800,"d":"21800.00 ر.س.‏"}},{"$f":"SUMIFS(tblData[المبلغ],tblData[‎التاريخ],\">=\"&DATE(YEAR(tblData[[#This Row],[‎التاريخ]]),1,1),tblData[‎التاريخ],\"<=\"&DATE(YEAR(tblData[[#This Row],[‎التاريخ]]),12,31),tblData[الربع],tblData[[#This Row],[الربع]])","v":{"v":50800,"d":"50800.00 ر.س.‏"}},{"$f":"SUMIFS(tblData[المبلغ],tblData[‎التاريخ],\">=\"&DATE(YEAR(tblData[[#This Row],[‎التاريخ]]),1,1),tblData[‎التاريخ],\"<=\"&DATE(YEAR(tblData[[#This Row],[‎التاريخ]]),12,31))","v":{"v":143800,"d":"143800.00 ر.س.‏"}},{"$f":"IFERROR(TREND($L$6:INDEX($L:$L,ROW(),1),$K$6:INDEX($K:$K,ROW(),1),IF(MONTH(tblData[[#This Row],[‎التاريخ]])=12,13,MONTH(tblData[[#This Row],[‎التاريخ]])+1)),\"\")","v":{"v":29000,"d":"29000.00 ر.س.‏"}},{"$f":"IFERROR(TREND($M$6:INDEX($M:$M,ROW(),1),$I$6:INDEX($I:$I,ROW(),1),IF(tblData[[#This Row],[الربع]]=4,5,tblData[[#This Row],[الربع]]+1)),\"\")","v":{"v":50800,"d":"50800.00 ر.س.‏"}},{"$f":"IFERROR(TREND($N$6:INDEX($N:$N,ROW(),1),$J$6:INDEX($J:$J,ROW(),1),tblData[[#This Row],[السة]]+1),\"\")","v":{"v":143800,"d":"143800.00 ر.س.‏"}}]
[null,{"$f":"40693+(365*2)","v":"2013-05-29"},"الأخبار الرياضية",{"v":6200,"d":"6200.00 ر.س.‏"},{"v":6000,"d":"6000.00 ر.س.‏"},{"v":4500,"d":"4500.00 ر.س.‏"},{"$f":"tblData[[#This Row],[المبلغ]]-tblData[[#This Row],[التكلفة]]","v":{"v":1700,"d":"1700.00 ر.س.‏"}},{"$f":"DATE(YEAR('إدخال البيانات'!$B11),MONTH('إدخال البيانات'!$B11),1)","v":"2013-05-01"},{"$f":"LOOKUP(MONTH('إدخال البيانات'!$H11),{1,1;2,1;3,1;4,2;5,2;6,2;7,3;8,3;9,3;10,4;11,4;12,4})","v":{"v":2,"d":"الربع 2"}},{"$f":"YEAR('إدخال البيانات'!$B11)","v":2013},{"$f":"MONTH(tblData[[#This Row],[‎التاريخ]])","v":5},{"$f":"SUMIFS(tblData[المبلغ],tblData[‎التاريخ],\">=\"&EOMONTH(tblData[[#This Row],[‎التاريخ]],-1)+1,tblData[‎التاريخ],\"<=\"&EOMONTH(tblData[[#This Row],[‎التاريخ]],0))","v":{"v":21800,"d":"21800.00 ر.س.‏"}},{"$f":"SUMIFS(tblData[المبلغ],tblData[‎التاريخ],\">=\"&DATE(YEAR(tblData[[#This Row],[‎التاريخ]]),1,1),tblData[‎التاريخ],\"<=\"&DATE(YEAR(tblData[[#This Row],[‎التاريخ]]),12,31),tblData[الربع],tblData[[#This Row],[الربع]])","v":{"v":50800,"d":"50800.00 ر.س.‏"}},{"$f":"SUMIFS(tblData[المبلغ],tblData[‎التاريخ],\">=\"&DATE(YEAR(tblData[[#This Row],[‎التاريخ]]),1,1),tblData[‎التاريخ],\"<=\"&DATE(YEAR(tblData[[#This Row],[‎التاريخ]]),12,31))","v":{"v":143800,"d":"143800.00 ر.س.‏"}},{"$f":"IFERROR(TREND($L$6:INDEX($L:$L,ROW(),1),$K$6:INDEX($K:$K,ROW(),1),IF(MONTH(tblData[[#This Row],[‎التاريخ]])=12,13,MONTH(tblData[[#This Row],[‎التاريخ]])+1)),\"\")","v":{"v":29000,"d":"29000.00 ر.س.‏"}},{"$f":"IFERROR(TREND($M$6:INDEX($M:$M,ROW(),1),$I$6:INDEX($I:$I,ROW(),1),IF(tblData[[#This Row],[الربع]]=4,5,tblData[[#This Row],[الربع]]+1)),\"\")","v":{"v":50800,"d":"50800.00 ر.س.‏"}},{"$f":"IFERROR(TREND($N$6:INDEX($N:$N,ROW(),1),$J$6:INDEX($J:$J,ROW(),1),tblData[[#This Row],[السة]]+1),\"\")","v":{"v":143800,"d":"143800.00 ر.س.‏"}}]
[null,{"$f":"40705+(365*2)","v":"2013-06-10"},"شركة القمر المنير",{"v":6900,"d":"6900.00 ر.س.‏"},{"v":7500,"d":"7500.00 ر.س.‏"},{"v":5400,"d":"5400.00 ر.س.‏"},{"$f":"tblData[[#This Row],[المبلغ]]-tblData[[#This Row],[التكلفة]]","v":{"v":1500,"d":"1500.00 ر.س.‏"}},{"$f":"DATE(YEAR('إدخال البيانات'!$B12),MONTH('إدخال البيانات'!$B12),1)","v":"2013-06-01"},{"$f":"LOOKUP(MONTH('إدخال البيانات'!$H12),{1,1;2,1;3,1;4,2;5,2;6,2;7,3;8,3;9,3;10,4;11,4;12,4})","v":{"v":2,"d":"الربع 2"}},{"$f":"YEAR('إدخال البيانات'!$B12)","v":2013},{"$f":"MONTH(tblData[[#This Row],[‎التاريخ]])","v":6},{"$f":"SUMIFS(tblData[المبلغ],tblData[‎التاريخ],\">=\"&EOMONTH(tblData[[#This Row],[‎التاريخ]],-1)+1,tblData[‎التاريخ],\"<=\"&EOMONTH(tblData[[#This Row],[‎التاريخ]],0))","v":{"v":14400,"d":"14400.00 ر.س.‏"}},{"$f":"SUMIFS(tblData[المبلغ],tblData[‎التاريخ],\">=\"&DATE(YEAR(tblData[[#This Row],[‎التاريخ]]),1,1),tblData[‎التاريخ],\"<=\"&DATE(YEAR(tblData[[#This Row],[‎التاريخ]]),12,31),tblData[الربع],tblData[[#This Row],[الربع]])","v":{"v":50800,"d":"50800.00 ر.س.‏"}},{"$f":"SUMIFS(tblData[المبلغ],tblData[‎التاريخ],\">=\"&DATE(YEAR(tblData[[#This Row],[‎التاريخ]]),1,1),tblData[‎التاريخ],\"<=\"&DATE(YEAR(tblData[[#This Row],[‎التاريخ]]),12,31))","v":{"v":143800,"d":"143800.00 ر.س.‏"}},{"$f":"IFERROR(TREND($L$6:INDEX($L:$L,ROW(),1),$K$6:INDEX($K:$K,ROW(),1),IF(MONTH(tblData[[#This Row],[‎التاريخ]])=12,13,MONTH(tblData[[#This Row],[‎التاريخ]])+1)),\"\")","v":{"v":21600.000000000004,"d":"21600.00 ر.س.‏"}},{"$f":"IFERROR(TREND($M$6:INDEX($M:$M,ROW(),1),$I$6:INDEX($I:$I,ROW(),1),IF(tblData[[#This Row],[الربع]]=4,5,tblData[[#This Row],[الربع]]+1)),\"\")","v":{"v":50800,"d":"50800.00 ر.س.‏"}},{"$f":"IFERROR(TREND($N$6:INDEX($N:$N,ROW(),1),$J$6:INDEX($J:$J,ROW(),1),tblData[[#This Row],[السة]]+1),\"\")","v":{"v":143800,"d":"143800.00 ر.س.‏"}}]
[null,{"$f":"40716+(365*2)","v":"2013-06-21"},"القمر المنير للصيدلة",{"v":7500,"d":"7500.00 ر.س.‏"},{"v":7200,"d":"7200.00 ر.س.‏"},{"v":6500,"d":"6500.00 ر.س.‏"},{"$f":"tblData[[#This Row],[المبلغ]]-tblData[[#This Row],[التكلفة]]","v":{"v":1000,"d":"1000.00 ر.س.‏"}},{"$f":"DATE(YEAR('إدخال البيانات'!$B13),MONTH('إدخال البيانات'!$B13),1)","v":"2013-06-01"},{"$f":"LOOKUP(MONTH('إدخال البيانات'!$H13),{1,1;2,1;3,1;4,2;5,2;6,2;7,3;8,3;9,3;10,4;11,4;12,4})","v":{"v":2,"d":"الربع 2"}},{"$f":"YEAR('إدخال البيانات'!$B13)","v":2013},{"$f":"MONTH(tblData[[#This Row],[‎التاريخ]])","v":6},{"$f":"SUMIFS(tblData[المبلغ],tblData[‎التاريخ],\">=\"&EOMONTH(tblData[[#This Row],[‎التاريخ]],-1)+1,tblData[‎التاريخ],\"<=\"&EOMONTH(tblData[[#This Row],[‎التاريخ]],0))","v":{"v":14400,"d":"14400.00 ر.س.‏"}},{"$f":"SUMIFS(tblData[المبلغ],tblData[‎التاريخ],\">=\"&DATE(YEAR(tblData[[#This Row],[‎التاريخ]]),1,1),tblData[‎التاريخ],\"<=\"&DATE(YEAR(tblData[[#This Row],[‎التاريخ]]),12,31),tblData[الربع],tblData[[#This Row],[الربع]])","v":{"v":50800,"d":"50800.00 ر.س.‏"}},{"$f":"SUMIFS(tblData[المبلغ],tblData[‎التاريخ],\">=\"&DATE(YEAR(tblData[[#This Row],[‎التاريخ]]),1,1),tblData[‎التاريخ],\"<=\"&DATE(YEAR(tblData[[#This Row],[‎التاريخ]]),12,31))","v":{"v":143800,"d":"143800.00 ر.س.‏"}},{"$f":"IFERROR(TREND($L$6:INDEX($L:$L,ROW(),1),$K$6:INDEX($K:$K,ROW(),1),IF(MONTH(tblData[[#This Row],[‎التاريخ]])=12,13,MONTH(tblData[[#This Row],[‎التاريخ]])+1)),\"\")","v":{"v":17950,"d":"17950.00 ر.س.‏"}},{"$f":"IFERROR(TREND($M$6:INDEX($M:$M,ROW(),1),$I$6:INDEX($I:$I,ROW(),1),IF(tblData[[#This Row],[الربع]]=4,5,tblData[[#This Row],[الربع]]+1)),\"\")","v":{"v":50800,"d":"50800.00 ر.س.‏"}},{"$f":"IFERROR(TREND($N$6:INDEX($N:$N,ROW(),1),$J$6:INDEX($J:$J,ROW(),1),tblData[[#This Row],[السة]]+1),\"\")","v":{"v":143800,"d":"143800.00 ر.س.‏"}}]
[null,{"$f":"40731+(365*2)","v":"2013-07-06"},"الشركة الوطنية للإنتاج",{"v":8700,"d":"8700.00 ر.س.‏"},{"v":8500,"d":"8500.00 ر.س.‏"},{"v":7250,"d":"7250.00 ر.س.‏"},{"$f":"tblData[[#This Row],[المبلغ]]-tblData[[#This Row],[التكلفة]]","v":{"v":1450,"d":"1450.00 ر.س.‏"}},{"$f":"DATE(YEAR('إدخال البيانات'!$B14),MONTH('إدخال البيانات'!$B14),1)","v":"2013-07-01"},{"$f":"LOOKUP(MONTH('إدخال البيانات'!$H14),{1,1;2,1;3,1;4,2;5,2;6,2;7,3;8,3;9,3;10,4;11,4;12,4})","v":{"v":3,"d":"الربع 3"}},{"$f":"YEAR('إدخال البيانات'!$B14)","v":2013},{"$f":"MONTH(tblData[[#This Row],[‎التاريخ]])","v":7},{"$f":"SUMIFS(tblData[المبلغ],tblData[‎التاريخ],\">=\"&EOMONTH(tblData[[#This Row],[‎التاريخ]],-1)+1,tblData[‎التاريخ],\"<=\"&EOMONTH(tblData[[#This Row],[‎التاريخ]],0))","v":{"v":8700,"d":"8700.00 ر.س.‏"}},{"$f":"SUMIFS(tblData[المبلغ],tblData[‎التاريخ],\">=\"&DATE(YEAR(tblData[[#This Row],[‎التاريخ]]),1,1),tblData[‎التاريخ],\"<=\"&DATE(YEAR(tblData[[#This Row],[‎التاريخ]]),12,31),tblData[الربع],tblData[[#This Row],[الربع]])","v":{"v":49100,"d":"49100.00 ر.س.‏"}},{"$f":"SUMIFS(tblData[المبلغ],tblData[‎التاريخ],\">=\"&DATE(YEAR(tblData[[#This Row],[‎التاريخ]]),1,1),tblData[‎التاريخ],\"<=\"&DATE(YEAR(tblData[[#This Row],[‎التاريخ]]),12,31))","v":{"v":143800,"d":"143800.00 ر.س.‏"}},{"$f":"IFERROR(TREND($L$6:INDEX($L:$L,ROW(),1),$K$6:INDEX($K:$K,ROW(),1),IF(MONTH(tblData[[#This Row],[‎التاريخ]])=12,13,MONTH(tblData[[#This Row],[‎التاريخ]])+1)),\"\")","v":{"v":10776.470588235294,"d":"10776.47 ر.س.‏"}},{"$f":"IFERROR(TREND($M$6:INDEX($M:$M,ROW(),1),$I$6:INDEX($I:$I,ROW(),1),IF(tblData[[#This Row],[الربع]]=4,5,tblData[[#This Row],[الربع]]+1)),\"\")","v":{"v":47400,"d":"47400.00 ر.س.‏"}},{"$f":"IFERROR(TREND($N$6:INDEX($N:$N,ROW(),1),$J$6:INDEX($J:$J,ROW(),1),tblData[[#This Row],[السة]]+1),\"\")","v":{"v":143800,"d":"143800.00 ر.س.‏"}}]
[null,{"$f":"40761+(365*2)","v":"2013-08-05"}," مسرح الشركة الوطنية",{"v":8500,"d":"8500.00 ر.س.‏"},{"v":8300,"d":"8300.00 ر.س.‏"},{"v":7100,"d":"7100.00 ر.س.‏"},{"$f":"tblData[[#This Row],[المبلغ]]-tblData[[#This Row],[التكلفة]]","v":{"v":1400,"d":"1400.00 ر.س.‏"}},{"$f":"DATE(YEAR('إدخال البيانات'!$B15),MONTH('إدخال البيانات'!$B15),1)","v":"2013-08-01"},{"$f":"LOOKUP(MONTH('إدخال البيانات'!$H15),{1,1;2,1;3,1;4,2;5,2;6,2;7,3;8,3;9,3;10,4;11,4;12,4})","v":{"v":3,"d":"الربع 3"}},{"$f":"YEAR('إدخال البيانات'!$B15)","v":2013},{"$f":"MONTH(tblData[[#This Row],[‎التاريخ]])","v":8},{"$f":"SUMIFS(tblData[المبلغ],tblData[‎التاريخ],\">=\"&EOMONTH(tblData[[#This Row],[‎التاريخ]],-1)+1,tblData[‎التاريخ],\"<=\"&EOMONTH(tblData[[#This Row],[‎التاريخ]],0))","v":{"v":16400,"d":"16400.00 ر.س.‏"}},{"$f":"SUMIFS(tblData[المبلغ],tblData[‎التاريخ],\">=\"&DATE(YEAR(tblData[[#This Row],[‎التاريخ]]),1,1),tblData[‎التاريخ],\"<=\"&DATE(YEAR(tblData[[#This Row],[‎التاريخ]]),12,31),tblData[الربع],tblData[[#This Row],[الربع]])","v":{"v":49100,"d":"49100.00 ر.س.‏"}},{"$f":"SUMIFS(tblData[المبلغ],tblData[‎التاريخ],\">=\"&DATE(YEAR(tblData[[#This Row],[‎التاريخ]]),1,1),tblData[‎التاريخ],\"<=\"&DATE(YEAR(tblData[[#This Row],[‎التاريخ]]),12,31))","v":{"v":143800,"d":"143800.00 ر.س.‏"}},{"$f":"IFERROR(TREND($L$6:INDEX($L:$L,ROW(),1),$K$6:INDEX($K:$K,ROW(),1),IF(MONTH(tblData[[#This Row],[‎التاريخ]])=12,13,MONTH(tblData[[#This Row],[‎التاريخ]])+1)),\"\")","v":{"v":12455.862068965516,"d":"12455.86 ر.س.‏"}},{"$f":"IFERROR(TREND($M$6:INDEX($M:$M,ROW(),1),$I$6:INDEX($I:$I,ROW(),1),IF(tblData[[#This Row],[الربع]]=4,5,tblData[[#This Row],[الربع]]+1)),\"\")","v":{"v":47400,"d":"47400.00 ر.س.‏"}},{"$f":"IFERROR(TREND($N$6:INDEX($N:$N,ROW(),1),$J$6:INDEX($J:$J,ROW(),1),tblData[[#This Row],[السة]]+1),\"\")","v":{"v":143800,"d":"143800.00 ر.س.‏"}}]
{"$rows_left_out":10}
{"sheet":"تقرير المبيعات","index":1,"n_rows":27,"n_cols":5,"rows_kept":27}
[]
[null,"تقرير المبيعات الشهري"]
[]
[]
[null,"الربع","الشهر","الشركة","مجموع المبيعات"]
[null,{"v":2,"d":"الربع 2"},"2013-04-01","القمر المنير للصيدلة",{"v":8200,"d":"8200.00 ر.س.‏"}]
[{"$nulls":3},"شركة القمر المنير",{"v":6400,"d":"6400.00 ر.س.‏"}]
[null,null,"2013-05-01"," مسرح الشركة الوطنية",{"v":5400,"d":"5400.00 ر.س.‏"}]
[{"$nulls":3},"الأخبار الرياضية",{"v":6200,"d":"6200.00 ر.س.‏"}]
[{"$nulls":3},"الشركة الوطنية",{"v":5800,"d":"5800.00 ر.س.‏"}]
[{"$nulls":3},"الشركة الوطنية للإنتاج",{"v":4400,"d":"4400.00 ر.س.‏"}]
[null,null,"2013-06-01","القمر المنير للصيدلة",{"v":7500,"d":"7500.00 ر.س.‏"}]
[{"$nulls":3},"شركة القمر المنير",{"v":6900,"d":"6900.00 ر.س.‏"}]
[null,"إجمالي الربع 2",null,null,{"v":50800,"d":"50800.00 ر.س.‏"}]
[null,{"v":3,"d":"الربع 3"},"2013-07-01","الشركة الوطنية للإنتاج",{"v":8700,"d":"8700.00 ر.س.‏"}]
{"$rows_left_out":13}
{"sheet":"التنبؤ بالمبيعات","index":2,"n_rows":43,"n_cols":10,"rows_kept":43}
[]
[null,"التنبؤ بالمبيعات الشهرية"]
[null,{"$f":"\"تاريخ اليوم: \"&TEXT(TODAY(),\"d mmmm yyyy\")","v":"تاريخ اليوم: 10 أكتوبر 2012"},null,{"$f":"--TRIM(RIGHT(B3,LEN(B3)-FIND(\":\",B3)))","v":"2012-10-10"}]
[]
[null,"هذا الشهر","الفعلي","المخطط","الفرق","%","الفعلي من بداية السنة حتى اليوم","المخطط من بداية السنة حتى اليوم","الفرق من بداية السنة حتى اليوم","النسبة من بداية السنة حتى اليوم"]
[null,"الكمية",{"$f":"COUNTIF('إدخال البيانات'!$B$6:$B$24,\">=\"&DATE(fYear,MONTH(fDate),1))-COUNTIF('إدخال البيانات'!$B$6:$B$24,\">\"&EOMONTH(fDate,0))","v":0},{"$nulls":3},{"$f":"COUNTIF(tblData[‎التاريخ],\"<=\"&EOMONTH(fDate,0))","v":0}]
[null,"المبيعات",{"$f":"SUMIF(tblData[‎التاريخ],\">=\"&DATE(fYear,MONTH(fDate),1),tblData[المبلغ])-SUMIF(tblData[‎التاريخ],\">\"&EOMONTH(fDate,0),tblData[المبلغ])","v":{"v":0,"d":"0.00 ر.س.‏"}},{"$f":"SUMIF('إدخال البيانات'!$B$6:$B$24,\">=\"&DATE(fYear,MONTH(fDate),1),'إدخال البيانات'!$E$6:$E$24)-SUMIF('إدخال البيانات'!$B$6:$B$24,\">\"&EOMONTH(fDate,0),'إدخال البيانات'!$E$6:$E$24)","v":{"v":0,"d":"0.00 ر.س.‏"}},{"$f":"D7-C7","v":{"v":0,"d":"0.00 ر.س.‏"}},{"$f":"IFERROR(D7/C7,\"-\")","v":"-"},{"$f":"SUMIF(tblData[‎التاريخ],\"<=\"&EOMONTH(fDate,0),tblData[المبلغ])","v":{"v":0,"d":"0.00 ر.س.‏"}},{"$f":"SUMIF(tblData[‎التاريخ],\"<=\"&EOMONTH(fDate,0),tblData[المخطط])","v":{"v":0,"d":"0.00 ر.س.‏"}},{"$f":"H7-G7","v":{"v":0,"d":"0.00 ر.س.‏"}},{"$f":"IFERROR(H7/G7,\"\")","v":""}]
[null,"العائدات",{"$f":"(SUMIF(tblData[‎التاريخ],\">=\"&DATE(fYear,MONTH(fDate),1),tblData[المبلغ])-SUMIF(tblData[‎التاريخ],\">\"&EOMONTH(fDate,0),tblData[المبلغ]))-(SUMIF(tblData[‎التاريخ],\">=\"&DATE(fYear,MONTH(fDate),1),tblData[التكلفة])-SUMIF(tblData[‎التاريخ],\">\"&EOMONTH(fDate,0),tblData[التكلفة]))","v":{"v":0,"d":"0.00 ر.س.‏"}},{"$f":"(SUMIF('إدخال البيانات'!$B$6:$B$24,\">=\"&DATE(fYear,MONTH(fDate),1),'إدخال البيانات'!$E$6:$E$24)-SUMIF('إدخال البيانات'!$B$6:$B$24,\">\"&EOMONTH(fDate,0),'إدخال البيانات'!$E$6:$E$24))-(SUMIF('إدخال البيانات'!$B$6:$B$24,\">=\"&DATE(fYear,MONTH(fDate),1),'إدخال البيانات'!$F$6:$F$24)-SUMIF('إدخال البيانات'!$B$6:$B$24,\">\"&EOMONTH(fDate,0),'إدخال البيانات'!$F$6:$F$24))","v":{"v":0,"d":"0.00 ر.س.‏"}},{"$f":"D8-C8","v":{"v":0,"d":"0.00 ر.س.‏"}},{"$f":"IFERROR(D8/C8,\"-\")","v":"-"},{"$f":"SUMIF('إدخال البيانات'!$B$6:$B$24,\"<=\"&EOMONTH(fDate,0),'إدخال البيانات'!$F$6:$F$24)","v":{"v":0,"d":"0.00 ر.س.‏"}},{"$f":"SUMIF(tblData[‎التاريخ],\"<=\"&EOMONTH(fDate,0),tblData[التكلفة])","v":{"v":0,"d":"0.00 ر.س.‏"}},{"$f":"H8-G8","v":{"v":0,"d":"0.00 ر.س.‏"}},{"$f":"IFERROR(H8/G8,\"\")","v":""}]
[null,"الهامش",{"$f":"IFERROR(C8/C7,\"-\")","v":"-"},{"$f":"IFERROR(D8/D7,\"-\")","v":"-"},null,{"$f":"IFERROR(F8/F7,\"-\")","v":"-"},{"$f":"IFERROR(G8/G7,\"\")","v":""},{"$f":"IFERROR(H8/H7,\"\")","v":""},null,{"$f":"IFERROR(J8/J7,\"\")","v":""}]
[null,"عدد الطلبات",{"$f":"COUNTIF(tblData[‎التاريخ],\">=\"&DATE(fYear,MONTH(fDate),1))-COUNTIF(tblData[‎التاريخ],\">\"&EOMONTH(fDate,0))","v":{"v":0,"d":"0.00 ر.س.‏"}},{"$nulls":3},{"$f":"COUNTIF(tblData[‎التاريخ],\">\"&EOMONTH(fDate,0))","v":{"v":19,"d":"19.00 ر.س.‏"}}]
[null,"متوسط قيمة الطلب",{"$f":"IFERROR(C7/C10,\"-\")","v":"-"},{"$nulls":3},{"$f":"IFERROR(G7/G10,\"-\")","v":{"v":0,"d":"0.00 ر.س.‏"}}]
[]
[null,"التنبؤ",null,"الشهر التالي",null,"الربع التالي",null,null,"السنة التالية"]
[null,"المبيعات",null,{"$f":"TREND(tblData[شهري],tblData[MONTH NUM (HIDE)],IF(MONTH(fDate)=12,13,MONTH(fDate)+1))","v":{"v":19802.70727580372,"d":"19,802.71 ر.س.‏"}},null,{"$f":"TREND(tblData[ربع سنوي],tblData[MONTH NUM (HIDE)],IF(MONTH(fDate)=12,13,MONTH(fDate)+1))","v":{"v":45107.44500846024,"d":"45,107.45 ر.س.‏"}},null,null,{"$f":"TREND(tblData[سنوي],tblData[MONTH NUM (HIDE)],IF(MONTH(fDate)=12,13,MONTH(fDate)+1))","v":{"v":143800,"d":"143,800.00 ر.س.‏"}}]
[]
{"$rows_left_out":10}