{"text_format":"3","workbook":"xlsx","n_sheets":9,"sheets":["ملخص","غرفة التدريس 1","غرفة التدريس 2","غرفة التدريس 3","غرفة التدريس 4","غرفة التدريس 5","غرفة التدريس 6","غرفة التدريس 7","جدول أعمال السنة"],"not_rendered":{"defined_names":9},"read":"whole","date_system":"1900"}

{"sheet":"ملخص","index":0,"n_rows":12,"n_cols":7,"rows_kept":12,"merged":[[1,1,1,2]]}
[]
[null,"اسم المدرسة",null,"اسمك:",null," نصف السنة/السنة:"]
[]
[null,"غرف التدريس","عدد الساعات","النسبة المئوية الحالية","حرف الدرجة الدراسية","إجمالي أعمال السنة","أعمال السنة التي حصل عليها"]
[null,"غرفة التدريس 1",{"v":3,"d":"3.0"},{"$f":"'غرفة التدريس 1'!D$36","v":{"v":0.8661764705882353,"d":"86.62%"}},"ب",{"$f":"IF(D5<>\"\",HLOOKUP(D5,'جدول أعمال السنة'!$C$5:$O$7,3),\"\")","v":{"v":3,"d":"3.00"}},{"$f":"IF(F5<>\"\",F5*C5/(SUM($C$5:$C$11)), \"\")","v":{"v":0.5625,"d":"0.56"}}]
[null,"غرفة التدريس 2",{"v":4,"d":"4.0"},{"$f":"'غرفة التدريس 2'!D$36","v":""},{"$f":"IF(D6<>\"\",HLOOKUP(D6,'جدول أعمال السنة'!$C$5:$O$7,2),\"\")","v":""},{"$f":"IF(D6<>\"\",HLOOKUP(D6,'جدول أعمال السنة'!$C$5:$O$7,3),\"\")","v":""},""]
[null,"غرفة التدريس 3",{"v":2,"d":"2.0"},{"$f":"'غرفة التدريس 3'!D$36","v":""},{"$f":"IF(D7<>\"\",HLOOKUP(D7,'جدول أعمال السنة'!$C$5:$O$7,2),\"\")","v":""},{"$f":"IF(D7<>\"\",HLOOKUP(D7,'جدول أعمال السنة'!$C$5:$O$7,3),\"\")","v":""},""]
[null,"غرفة التدريس 4",{"v":4,"d":"4.0"},{"$f":"'غرفة التدريس 4'!D$36","v":""},{"$f":"IF(D8<>\"\",HLOOKUP(D8,'جدول أعمال السنة'!$C$5:$O$7,2),\"\")","v":""},{"$f":"IF(D8<>\"\",HLOOKUP(D8,'جدول أعمال السنة'!$C$5:$O$7,3),\"\")","v":""},""]
[null,"غرفة التدريس 5",{"v":1,"d":"1.0"},{"$f":"'غرفة التدريس 5'!D$36","v":""},{"$f":"IF(D9<>\"\",HLOOKUP(D9,'جدول أعمال السنة'!$C$5:$O$7,2),\"\")","v":""},{"$f":"IF(D9<>\"\",HLOOKUP(D9,'جدول أعمال السنة'!$C$5:$O$7,3),\"\")","v":""},""]
[null,"غرفة التدريس 6",{"v":1,"d":"1.0"},{"$f":"'غرفة التدريس 6'!D$36","v":""},{"$f":"IF(D10<>\"\",HLOOKUP(D10,'جدول أعمال السنة'!$C$5:$O$7,2),\"\")","v":""},{"$f":"IF(D10<>\"\",HLOOKUP(D10,'جدول أعمال السنة'!$C$5:$O$7,3),\"\")","v":""},""]
[null,"غرفة التدريس 7",{"v":1,"d":"1.0"},{"$f":"'غرفة التدريس 7'!D$36","v":""},{"$f":"IF(D11<>\"\",HLOOKUP(D11,'جدول أعمال السنة'!$C$5:$O$7,2),\"\")","v":""},{"$f":"IF(D11<>\"\",HLOOKUP(D11,'جدول أعمال السنة'!$C$5:$O$7,3),\"\")","v":""},""]
[null,"الإجماليات",{"$f":"SUM(C5:C11)","v":16},{"$f":"AVERAGE(D5:D11)","v":{"v":0.8661764705882353,"d":"86.62%"}},"ب",{"$f":"AVERAGE(F5:F11)","v":{"v":3,"d":"3.00"}},{"$f":"SUM(G5:G11)","v":{"v":0.5625,"d":"0.56"}}]

{"sheet":"غرفة التدريس 1","index":1,"n_rows":38,"n_cols":8,"rows_kept":38,"merged":[[1,1,1,2]]}
[]
[null,{"$f":"ملخص!B5","v":"غرفة التدريس 1"}]
[null,"المعلم:",null,null,"النسبة المئوية لإجمالي النقاط المحتملة",null,null,{"$f":"IF(SUM($C$35:$H$35) <> 0,SUM($C$34:$H$34)/SUM($C$35:$H$35),\"\")","v":{"v":0.8661764705882353,"d":"86.62%"}}]
[null,"البريد الإلكتروني:",null,null,"الدرجة الدراسية الحالية",null,null,{"$f":"SUM($C$34:$H$34)","v":{"v":0.17323529411764707,"d":"17.32%"}}]
[]
[null,"التعيينات","الواجب المنزلي","المقالات","الاختبارات","المشروعات","نصف الفصل الدراسي","الاختبار النهائي"]
[null,"المقدار",{"v":0.1,"d":"10.0%"},{"v":0.1,"d":"10.0%"},{"v":0.15,"d":"15.0%"},{"v":0.15,"d":"15.0%"},{"v":0.2,"d":"20.0%"},{"v":0.3,"d":"30.0%"}]
[null,"الواجب المنزلي الأول",{"v":0.8823529411764706,"d":"0.88"}]
[null,"إعداد بحث حول حرب الخليج",null,0.85]
{"$rows_empty":24}
[null,"إجمالي النقاط",{"$f":"IF(COUNT(C8:C33) <> 0,AVERAGE(C8:C33) *C7, \"\")","v":{"v":0.08823529411764706,"d":"0.0882"}},{"v":0.085,"d":"0.0850"},"","","",""]
[null,"إجمالي النقاط المحتملة",{"$f":"IF(COUNT(C8:C33)<>0,C7,\"\")","v":0.1},0.1,"","","",""]
[null,"النسبة المئوية لإجمالي النقاط المحتملة",null,{"$f":"IF(SUM($C$35:$H$35) <> 0,SUM($C$34:$H$34)/SUM($C$35:$H$35),\"\")","v":{"v":0.8661764705882353,"d":"86.62%"}}]
[null,"لإدخال الصفوف الدراسية:","أدخل النقاط التي حصلت عليها عبر عدد النقاط المحتملة (مثل 15/17)."]
[null,null,"أدخل النسبة المئوية التي حصلت عليها (مثل 85%)."]

{"sheet":"غرفة التدريس 2","index":2,"n_rows":38,"n_cols":8,"rows_kept":38,"merged":[[1,1,1,2]]}
[]
[null,{"$f":"ملخص!B6","v":"غرفة التدريس 2"}]
[null,"المعلم:",null,null,"النسبة المئوية لإجمالي النقاط المحتملة",null,null,{"$f":"IF(SUM($C$35:$H$35) <> 0,SUM($C$34:$H$34)/SUM($C$35:$H$35),\"\")","v":""}]
[null,"البريد الإلكتروني:",null,null,"الدرجة الدراسية الحالية",null,null,{"$f":"SUM($C$34:$H$34)","v":{"v":0,"d":"0.00%"}}]
[]
[null,"التعيينات","الواجب المنزلي","المقالات","الاختبارات","المشروعات","نصف الفصل الدراسي","الاختبار النهائي"]
[null,"المقدار",{"v":0.1,"d":"10.0%"},{"v":0.1,"d":"10.0%"},{"v":0.15,"d":"15.0%"},{"v":0.15,"d":"15.0%"},{"v":0.2,"d":"20.0%"},{"v":0.3,"d":"30.0%"}]
{"$rows_empty":26}
[null,"إجمالي النقاط",{"$f":"IF(COUNT(C8:C33) <> 0,AVERAGE(C8:C33) *C7, \"\")","v":""},"","","","",""]
[null,"إجمالي النقاط المحتملة",{"$f":"IF(COUNT(C8:C33)<>0,C7,\"\")","v":""},"","","","",""]
[null,"النسبة المئوية لإجمالي النقاط المحتملة",null,{"$f":"IF(SUM($C$35:$H$35) <> 0,SUM($C$34:$H$34)/SUM($C$35:$H$35),\"\")","v":""}]
[null,"لإدخال الصفوف الدراسية:","أدخل النقاط التي حصلت عليها عبر عدد النقاط المحتملة (مثل 15/17)."]
[null,null,"أدخل النسبة المئوية التي حصلت عليها (مثل 85%)."]

{"sheet":"غرفة التدريس 3","index":3,"n_rows":38,"n_cols":8,"rows_kept":38,"merged":[[1,1,1,2]]}
[]
[null,{"$f":"ملخص!B7","v":"غرفة التدريس 3"}]
[null,"المعلم:",null,null,"النسبة المئوية لإجمالي النقاط المحتملة",null,null,{"$f":"IF(SUM($C$35:$H$35) <> 0,SUM($C$34:$H$34)/SUM($C$35:$H$35),\"\")","v":""}]
[null,"البريد الإلكتروني:",null,null,"الدرجة الدراسية الحالية",null,null,{"$f":"SUM($C$34:$H$34)","v":{"v":0,"d":"0.00%"}}]
[]
[null,"التعيينات","الواجب المنزلي","المقالات","الاختبارات","المشروعات","نصف الفصل الدراسي","الاختبار النهائي"]
[null,"المقدار",{"v":0.1,"d":"10.0%"},{"v":0.1,"d":"10.0%"},{"v":0.15,"d":"15.0%"},{"v":0.15,"d":"15.0%"},{"v":0.2,"d":"20.0%"},{"v":0.3,"d":"30.0%"}]
{"$rows_empty":26}
[null,"إجمالي النقاط",{"$f":"IF(COUNT(C8:C33) <> 0,AVERAGE(C8:C33) *C7, \"\")","v":""},"","","","",""]
[null,"إجمالي النقاط المحتملة",{"$f":"IF(COUNT(C8:C33)<>0,C7,\"\")","v":""},"","","","",""]
[null,"النسبة المئوية لإجمالي النقاط المحتملة",null,{"$f":"IF(SUM($C$35:$H$35) <> 0,SUM($C$34:$H$34)/SUM($C$35:$H$35),\"\")","v":""}]
[null,"لإدخال الصفوف الدراسية:","أدخل النقاط التي حصلت عليها عبر عدد النقاط المحتملة (مثل 15/17)."]
[null,null,"أدخل النسبة المئوية التي حصلت عليها (مثل 85%)."]

{"sheet":"غرفة التدريس 4","index":4,"n_rows":38,"n_cols":8,"rows_kept":38,"merged":[[1,1,1,2]]}
[]
[null,{"$f":"ملخص!B8","v":"غرفة التدريس 4"}]
[null,"المعلم:",null,null,"النسبة المئوية لإجمالي النقاط المحتملة"]
[null,"البريد الإلكتروني:",null,null,"الدرجة الدراسية الحالية",null,null,{"$f":"SUM($C$34:$H$34)","v":{"v":0,"d":"0.00%"}}]
[]
[null,"التعيينات","الواجب المنزلي","المقالات","الاختبارات","المشروعات","نصف الفصل الدراسي","الاختبار النهائي"]
[null,"المقدار",{"v":0.1,"d":"10.0%"},{"v":0.1,"d":"10.0%"},{"v":0.15,"d":"15.0%"},{"v":0.15,"d":"15.0%"},{"v":0.2,"d":"20.0%"},{"v":0.3,"d":"30.0%"}]
{"$rows_empty":26}
[null,"إجمالي النقاط",{"$f":"IF(COUNT(C8:C33) <> 0,AVERAGE(C8:C33) *C7, \"\")","v":""},"","","","",""]
[null,"إجمالي النقاط المحتملة",{"$f":"IF(COUNT(C8:C33)<>0,C7,\"\")","v":""},"","","","",""]
[null,"النسبة المئوية لإجمالي النقاط المحتملة",null,{"$f":"IF(SUM($C$35:$H$35) <> 0,SUM($C$34:$H$34)/SUM($C$35:$H$35),\"\")","v":""}]
[null,"لإدخال الصفوف الدراسية:","أدخل النقاط التي حصلت عليها عبر عدد النقاط المحتملة (مثل 15/17)."]
[null,null,"أدخل النسبة المئوية التي حصلت عليها (مثل 85%)."]

{"sheet":"غرفة التدريس 5","index":5,"n_rows":38,"n_cols":8,"rows_kept":38,"merged":[[1,1,1,2]]}
[]
[null,{"$f":"ملخص!B9","v":"غرفة التدريس 5"}]
[null,"المعلم:",null,null,"النسبة المئوية لإجمالي النقاط المحتملة",null,null,{"$f":"IF(SUM($C$35:$H$35) <> 0,SUM($C$34:$H$34)/SUM($C$35:$H$35),\"\")","v":""}]
[null,"البريد الإلكتروني:",null,null,"الدرجة الدراسية الحالية",null,null,{"$f":"SUM($C$34:$H$34)","v":{"v":0,"d":"0.00%"}}]
[]
[null,"التعيينات","الواجب المنزلي","المقالات","الاختبارات","المشروعات","نصف الفصل الدراسي","الاختبار النهائي"]
[null,"المقدار",{"v":0.1,"d":"10.0%"},{"v":0.1,"d":"10.0%"},{"v":0.15,"d":"15.0%"},{"v":0.15,"d":"15.0%"},{"v":0.2,"d":"20.0%"},{"v":0.3,"d":"30.0%"}]
{"$rows_empty":26}
[null,"إجمالي النقاط",{"$f":"IF(COUNT(C8:C33) <> 0,AVERAGE(C8:C33) *C7, \"\")","v":""},"","","","",""]
[null,"إجمالي النقاط المحتملة",{"$f":"IF(COUNT(C8:C33)<>0,C7,\"\")","v":""},"","","","",""]
[null,"النسبة المئوية لإجمالي النقاط المحتملة",null,{"$f":"IF(SUM($C$35:$H$35) <> 0,SUM($C$34:$H$34)/SUM($C$35:$H$35),\"\")","v":""}]
[null,"لإدخال الصفوف الدراسية:","أدخل النقاط التي حصلت عليها عبر عدد النقاط المحتملة (مثل 15/17)."]
[null,null,"أدخل النسبة المئوية التي حصلت عليها (مثل 85%)."]

{"sheet":"غرفة التدريس 6","index":6,"n_rows":38,"n_cols":8,"rows_kept":38,"merged":[[1,1,1,2]]}
[]
[null,{"$f":"ملخص!B10","v":"غرفة التدريس 6"}]
[null,"المعلم:",null,null,"النسبة المئوية لإجمالي النقاط المحتملة",null,null,{"$f":"IF(SUM($C$35:$H$35) <> 0,SUM($C$34:$H$34)/SUM($C$35:$H$35),\"\")","v":""}]
[null,"البريد الإلكتروني:",null,null,"الدرجة الدراسية الحالية",null,null,{"$f":"SUM($C$34:$H$34)","v":{"v":0,"d":"0.00%"}}]
[]
[null,"التعيينات","الواجب المنزلي","المقالات","الاختبارات","المشروعات","نصف الفصل الدراسي","الاختبار النهائي"]
[null,"المقدار",{"v":0.1,"d":"10.0%"},{"v":0.1,"d":"10.0%"},{"v":0.15,"d":"15.0%"},{"v":0.15,"d":"15.0%"},{"v":0.2,"d":"20.0%"},{"v":0.3,"d":"30.0%"}]
{"$rows_empty":26}
[null,"إجمالي النقاط",{"$f":"IF(COUNT(C8:C33) <> 0,AVERAGE(C8:C33) *C7, \"\")","v":""},"","","","",""]
[null,"إجمالي النقاط المحتملة",{"$f":"IF(COUNT(C8:C33)<>0,C7,\"\")","v":""},"","","","",""]
[null,"النسبة المئوية لإجمالي النقاط المحتملة",null,{"$f":"IF(SUM($C$35:$H$35) <> 0,SUM($C$34:$H$34)/SUM($C$35:$H$35),\"\")","v":""},{"$f":"IF(SUM($C$35:$H$35) <> 0,SUM($C$34:$H$34)/SUM($C$35:$H$35),\"\")","v":""}]
[null,"لإدخال الصفوف الدراسية:","أدخل النقاط التي حصلت عليها عبر عدد النقاط المحتملة (مثل 15/17)."]
[null,null,"أدخل النسبة المئوية التي حصلت عليها (مثل 85%)."]

{"sheet":"غرفة التدريس 7","index":7,"n_rows":38,"n_cols":8,"rows_kept":38,"merged":[[1,1,1,2]]}
[]
[null,{"$f":"ملخص!B11","v":"غرفة التدريس 7"}]
[null,"المعلم:",null,null,"النسبة المئوية لإجمالي النقاط المحتملة",null,null,{"$f":"IF(SUM($C$35:$H$35) <> 0,SUM($C$34:$H$34)/SUM($C$35:$H$35),\"\")","v":""}]
[null,"البريد الإلكتروني:",null,null,"الدرجة الدراسية الحالية",null,null,{"$f":"SUM($C$34:$H$34)","v":{"v":0,"d":"0.00%"}}]
[]
[null,"التعيينات","الواجب المنزلي","المقالات","الاختبارات","المشروعات","نصف الفصل الدراسي","الاختبار النهائي"]
[null,"المقدار",{"v":0.1,"d":"10.0%"},{"v":0.1,"d":"10.0%"},{"v":0.15,"d":"15.0%"},{"v":0.15,"d":"15.0%"},{"v":0.2,"d":"20.0%"},{"v":0.3,"d":"30.0%"}]
{"$rows_empty":26}
[null,"إجمالي النقاط",{"$f":"IF(COUNT(C8:C33) <> 0,AVERAGE(C8:C33) *C7, \"\")","v":""},"","","","",""]
[null,"إجمالي النقاط المحتملة",{"$f":"IF(COUNT(C8:C33)<>0,C7,\"\")","v":""},"","","","",""]
[null,"النسبة المئوية لإجمالي النقاط المحتملة",null,{"$f":"IF(SUM($C$35:$H$35) <> 0,SUM($C$34:$H$34)/SUM($C$35:$H$35),\"\")","v":""}]
[null,"لإدخال الصفوف الدراسية:","أدخل النقاط التي حصلت عليها عبر عدد النقاط المحتملة (مثل 15/17)."]
[null,null,"أدخل النسبة المئوية التي حصلت عليها (مثل 85%)."]

{"sheet":"جدول أعمال السنة","index":8,"n_rows":7,"n_cols":15,"rows_kept":7}
[]
[]
[]
[null,"جدول أعمال السنة والصف الدراسي"]
[null,"المتوسط",{"v":0,"d":"0%"},{"v":0.6,"d":"60%"},{"v":0.63,"d":"63%"},{"v":0.67,"d":"67%"},{"v":0.7,"d":"70%"},{"v":0.73,"d":"73%"},{"v":0.77,"d":"77%"},{"v":0.8,"d":"80%"},{"v":0.83,"d":"83%"},{"v":0.87,"d":"87%"},{"v":0.9,"d":"90%"},{"v":0.93,"d":"93%"},{"v":0.97,"d":"97%"}]
[null,"حرف الصف الدراسي","هـ","د-","د","د+","ج-","ج","ج+","ب-","ب","ب+","أ-","أ","أ+"]
[null,"أعمال السنة",{"v":0,"d":"0.00"},0.67,{"v":1,"d":"1.00"},1.33,1.67,{"v":2,"d":"2.00"},2.33,2.67,{"v":3,"d":"3.00"},3.33,3.67,{"v":4,"d":"4.00"},{"v":4,"d":"4.00"}]